program: Gaussian 09
title: 000123049
version: EM64L-G09RevD.01
frameworkgroup: C1[X(C13H10F2O)]
method: RPBEPBE
basis: SDD
operation: Freq
keyword: #p
keyword: freq=noraman
keyword: PBEPBE/SDD
title: #p freq=noraman PBEPBE/SDD
converged: YES YES NO NO
title: Mulliken charges:
elementType: F F O C C C C C C C C C C C C C H H H H H H H H H H
charge: -0.201926 -0.208286 -0.463198 -0.361533 0.469722 0.403286 -0.433202 -0.353042 -0.318727 -0.372065 -0.359377 -0.361770 -0.354768 -0.355615 0.311890 0.312331 0.219967 0.242269 0.243719 0.264840 0.294660 0.258729 0.254690 0.258872 0.254358 0.354176
chargesum: 0.00000
title: Mulliken charges with hydrogens summed into heavy atoms:
elementType: F F O C C C C C C C C C C C C C
charge: -0.201926 -0.208286 -0.109022 -0.141566 0.469722 0.403286 -0.190932 -0.109322 -0.053887 -0.077405 -0.100648 -0.107080 -0.095896 -0.101257 0.311890 0.312331
polarizability: 1.82814579e+02 7.13407138e+00 1.16517659e+02 -1.73136906e+01 -4.21141108e+00 1.11348347e+02
1716.lowfreq: -5.9410 -1.7237 -0.0007 -0.0006 -0.0003 5.1865 18.3467 27.7718 44.4092
frequency: 18.2325 27.5689 44.3994 109.0922 151.2693 171.5486 229.5614 268.4768 304.5779 317.3537 345.8381 378.2718 391.3897 410.4806 411.2803 446.8706 493.0656 509.0572 550.6979 580.9889 625.1156 627.6017 695.3228 723.2832 758.9537 770.3735 811.4631 820.2944 823.6395 831.3112 848.2516 860.9517 942.8754 952.6180 963.2915 973.3885 978.9916 1005.6500 1006.8502 1101.6524 1105.1078 1149.4372 1153.7617 1156.8889 1190.9386 1197.4044 1201.0866 1222.3348 1269.4964 1291.9847 1304.9257 1350.8584 1381.2631 1390.3749 1400.8808 1408.7178 1491.9293 1493.9771 1600.6328 1602.8905 1609.2787 1613.9799 2931.0674 3127.3292 3134.5496 3150.3296 3165.5114 3174.6727 3175.0929 3177.7292 3189.1624 3572.5327
redmass: 4.3837 4.3646 7.4194 7.6658 7.9105 6.7505 6.9562 3.3579 1.6231 5.0104 4.9788 6.1891 5.2292 2.9827 3.0234 4.8222 3.4092 5.5292 2.9198 5.9752 7.0946 7.2304 3.8261 4.1910 4.7224 3.6694 3.0698 1.2905 1.3466 1.9479 2.6714 2.0754 1.4026 1.3881 1.3580 5.0473 1.3955 2.7559 2.7640 1.3206 1.3011 1.6039 1.4341 1.4725 1.7777 1.9321 3.6216 1.5798 1.4078 1.2643 1.3722 1.6343 6.5613 6.0556 3.5828 2.6850 2.6625 2.7142 7.5738 7.9121 6.4232 6.4246 1.0832 1.0902 1.0897 1.0894 1.0897 1.0954 1.0954 1.0965 1.0957 1.0662
irintensity: 0.4769 0.1152 0.2515 0.2896 1.0030 1.4505 0.5951 33.1022 115.7786 17.5909 15.9266 3.8434 2.3852 0.6317 0.3635 0.7153 4.7500 34.5238 37.2442 23.4764 0.9308 0.1021 3.6633 5.8557 15.6549 19.2721 52.0073 7.4641 11.7469 99.2126 6.2996 25.3361 2.1160 3.1253 0.1883 60.4390 3.5084 14.3040 6.0049 8.1585 11.4092 69.3543 79.0664 8.1450 4.9277 44.2854 36.4656 17.4812 6.4318 5.7597 3.6277 46.6279 5.2911 3.1180 5.8961 7.3334 79.5574 117.4273 10.4614 7.4889 31.4702 12.2627 37.7217 9.6361 9.5652 3.1645 2.6974 3.4801 3.5121 2.4187 2.2630 9.5713
temp: 298.150 k
press: 1.00000 atm
elementType: 9 9 8 6 6 6 6 6 6 6 6 6 6 6 6 6 1 1 1 1 1 1 1 1 1 1
symmnumber: 1
zpe: 506427.3 jmol-1
zpe.correction: 0.192888 hartree
zpe.thermalcorrener: 0.206460 hartree
zpe.thermalcorrenthalpy: 0.207404 hartree
zpe.thermalcorrgfe: 0.150362 hartree
zpe.sumelectzpe: -775.156424 hartree
zpe.sumelectthermal: -775.142852 hartree
zpe.sumelectthermalent: -775.141908 hartree
zpe.sumelectthermalfe: -775.198949 hartree
dipole: -1.8463 1.7363 1.3131
dipole: 2.8544
quadrupole: -109.6807 -90.9063 -84.2949
quadrupole: -2.0377 -4.4663 -0.4824
quadrupole: -14.7201 4.0543 10.6658 -2.0377 -4.4663 -0.4824
hfenergy: -775.3493116 hartree
pointgroup: C01 [X(C13H10F2O1)]
dipole: -0.7440832 0.8247999 0.1650087 debye
dipolederiv: -0.9340744 -0.4317452 0.0920566 -0.5023337 -0.4586871 0.026651 0.0977741 0.0217533 -0.1923561 -0.9929586 0.3920969 -0.0739616 0.4755972 -0.3936972 0.071887 -0.0905036 0.0713056 -0.2056416 -0.4679957 -0.1466786 -0.0890926 -0.2460615 -0.6882068 0.1956181 -0.0658485 0.2543882 -0.6355204 0.5715293 0.0718956 0.0894115 0.1739358 0.5553784 -0.1303627 0.2011735 -0.1722648 0.5360752 -0.0201636 0.0047563 0.0095893 0.1119248 -0.1548079 -0.0135087 -0.0963538 -0.0032765 -0.1409935 0.0983574 -0.0882203 0.0218723 -0.2640104 -0.0635595 0.0382799 0.0333045 0.0688325 -0.1293673 0.0179519 0.0609764 -0.0763124 0.0334797 -0.0074112 0.0931725 -0.0905583 0.1146491 -0.0025879 -0.0226068 -0.0328616 -0.0382372 -0.0142989 -0.0582047 -0.0965275 -0.0775394 -0.0736536 0.0076179 -0.0301017 0.0283149 -0.0565939 0.0219289 0.0008925 0.0768401 -0.0849953 0.0525218 -0.0056043 -0.0525464 -0.0451513 -0.0463487 -0.007524 -0.0516346 -0.0675288 -0.0396004 -0.1001856 0.0207778 -0.1664705 -0.0342686 -0.0363984 -0.181348 -0.2028665 0.0489577 -0.1527387 -0.039873 -0.0586378 -0.2493958 0.052992 -0.0455098 -0.0280029 -0.1081612 -0.0469069 0.101443 -0.1077666 -0.0487123 -0.2366775 -0.0474415 0.0049499 0.0379451 -0.0511965 0.0627078 0.0990141 0.129035 -0.086866 -0.1338585 0.0042097 -0.0604996 0.1216873 -0.1798916 -0.0254078 -0.1827185 0.0356431 -0.0744263 0.9842261 0.4900487 -0.1363611 0.5740865 0.4946323 0.0184386 -0.1123831 0.0301732 0.1992764 1.0359233 -0.4571373 0.0542324 -0.5204896 0.3850676 -0.1214473 0.0803013 -0.1158117 0.2202766 -0.0512905 0.0707029 0.0248189 0.0492513 -0.0846898 -0.061382 -0.0426016 -0.078156 -0.1221145 0.1074871 -0.0662373 -0.0227136 -0.0435336 -0.0073842 -0.1031037 -0.0098687 -0.0934653 0.0502274 0.0189475 0.0065169 0.111246 -0.0094426 0.1043057 0.0189211 0.1302882 0.0339832 0.0386255 0.0649809 0.010676 0.0932864 0.0255967 0.0998328 -0.0253567 0.1027468 -0.0391789 0.0540521 0.1715064 0.0077633 0.0036709 0.0038333 0.1014455 0.0650399 -0.0045679 0.0676671 0.0467684 0.0323162 -0.0098579 0.0913382 -0.0128887 0.125871 -0.0481619 0.1032384 -0.0455374 0.0633841 0.0918285 0.0385134 -0.0035148 0.0536469 0.0897748 0.1000466 -0.0163566 0.1000481 0.0306469 0.096803 -0.0467708 0.0051049 -0.0617792 0.0399045 -0.0894872 -0.0003023 -0.0922314 0.0810682 0.0023961 0.0192409 0.0838996 0.0243543 0.1459477 0.0364546 0.0946381 0.0347911 0.0559496 0.0638863 0.1476667 0.000067 0.1844452 0.3673458 -0.023834 0.0230146 -0.0533905 0.2980817 unknown
polarizability: 181.6734647|0.0713555|111.9231973|-20.5111002|-5.0330739|117.0839226 unknown
InChI: InChI=1S/C13H10F2O/c14-11-5-1-9(2-6-11)13(16)10-3-7-12(15)8-4-10/h1-8,13,16H
charge 0 multiplicity 1
26 atoms
F  -4.806253 -1.659723 0.389109
F  4.886939 -1.3797 0.417419
O  -0.03344 2.142724 -1.499999
C  -0.048715 1.496918 -0.169583
C  -1.302761 0.64101 0.001359
C  1.259403 0.712002 -0.041853
C  -2.254099 0.9487 1.003703
C  1.464204 -0.132937 1.078465
C  -1.544332 -0.451972 -0.872261
C  2.288229 0.848414 -1.004433
C  -3.434301 0.18268 1.146767
C  2.67632 -0.836844 1.242906
C  -2.714764 -1.226979 -0.750284
C  3.507204 0.14753 -0.860156
C  -3.634083 -0.888471 0.261299
C  3.672143 -0.678006 0.263297
H  -0.063499 2.286721 0.615118
H  -2.077659 1.79348 1.680808
H  0.669663 -0.254393 1.823623
H  -0.807914 -0.68843 -1.647356
H  2.122494 1.501623 -1.864215
H  -4.179187 0.405618 1.915838
H  2.849205 -1.494177 2.099868
H  -2.919309 -2.072925 -1.412932
H  4.311551 0.238232 -1.595996
H  -0.905742 2.589306 -1.642113
