program: Gaussian 09
title: 000123043
version: EM64L-G09RevD.01
frameworkgroup: C1[X(C13H9N)]
method: RPBEPBE
basis: SDD
operation: Freq
keyword: #pfreq=noraman
keyword: PBEPBE/SDD
title: #p freq=noraman PBEPBE/SDD
converged: NO YES NO YES
title: Mulliken charges:
elementType: N C C C C C C C C C C C C C H H H H H H H H H
charge: 0.006767 0.222640 0.267504 0.428343 0.334079 -0.466056 -0.437859 -0.374188 -0.430511 -0.302368 -0.513688 -0.255009 -0.238997 -0.368665 0.238741 0.236134 0.227090 0.222014 0.242263 0.255943 0.231742 0.232404 0.241677
chargesum: 0.00000
title: Mulliken charges with hydrogens summed into heavy atoms:
elementType: N C C C C C C C C C C C C C
charge: 0.006767 0.222640 0.267504 0.428343 0.334079 -0.227314 -0.201725 -0.147098 -0.188248 -0.080354 -0.257744 -0.023267 -0.006594 -0.126988
polarizability: 2.31947287e+02 -9.19424182e-01 1.59184597e+02 2.20452327e-03 2.08822807e-04 5.56273263e+01
1716.lowfreq: -8.0315 -7.8104 -0.0009 -0.0004 0.0008 13.1278 101.2697 104.2208 225.4290
frequency: 101.2696 104.2177 225.4288 236.9555 243.5657 376.2246 395.7556 426.3542 437.6110 493.9640 503.7698 542.8275 554.4516 615.2158 618.5965 703.8224 721.8114 736.0406 759.3453 804.8394 824.9092 831.3803 849.0774 867.3875 892.8387 928.8277 957.8966 967.8299 986.8461 996.8384 1000.6330 1031.2038 1044.5661 1105.3288 1158.1266 1178.3102 1185.6853 1229.4106 1231.1167 1261.7358 1287.5766 1312.4738 1351.6242 1387.0638 1402.7675 1423.6965 1441.8895 1449.8942 1484.9258 1511.6216 1568.2115 1577.5794 1615.6948 1628.0221 3109.4373 3120.2652 3123.7732 3133.8366 3137.6695 3144.8669 3149.8494 3163.6782 3167.9077
redmass: 5.0524 3.7681 3.5387 4.9917 5.0688 2.8359 7.3050 2.9500 4.7590 5.6754 3.6275 2.7477 7.2012 3.6174 7.5444 5.9490 6.1049 2.9241 1.2587 1.7533 6.4216 1.7859 1.3741 4.3223 1.9341 1.5309 1.4183 1.4179 1.3856 1.3797 6.0921 2.2499 2.7547 2.1335 1.2857 1.1125 1.6596 1.7166 2.1329 1.4663 1.7331 2.9075 3.4079 2.0292 3.9596 2.3660 2.5266 2.9045 3.1795 3.5597 7.1374 5.9527 6.4588 6.6089 1.0911 1.0865 1.0866 1.0878 1.0883 1.0984 1.0945 1.0984 1.0979
irintensity: 0.0198 0.0879 3.6819 0.0846 2.5303 0.3991 0.1744 14.6194 2.2700 0.0985 0.3026 0.4382 0.2040 3.5104 9.1768 0.2012 3.3793 15.3686 64.3686 0.1571 2.2706 10.4120 73.0433 3.5850 10.8987 11.0940 2.3870 2.2752 0.0081 0.1401 1.3316 10.8622 1.4135 3.7427 0.2388 1.8242 4.2142 5.8922 3.7008 15.3346 0.9279 2.0795 2.3298 2.8674 2.4410 10.1229 9.1927 2.6343 7.7808 15.6522 2.5243 22.1087 1.8511 6.6700 20.9343 1.3139 3.5335 1.8082 13.6859 27.9649 17.9857 24.6871 35.7606
temp: 298.150 k
press: 1.00000 atm
elementType: 7 6 6 6 6 6 6 6 6 6 6 6 6 6 1 1 1 1 1 1 1 1 1
symmnumber: 1
zpe: 471486.2 jmol-1
zpe.correction: 0.179580 hartree
zpe.thermalcorrener: 0.189059 hartree
zpe.thermalcorrenthalpy: 0.190004 hartree
zpe.thermalcorrgfe: 0.144662 hartree
zpe.sumelectzpe: -554.618739 hartree
zpe.sumelectthermal: -554.609259 hartree
zpe.sumelectthermalent: -554.608315 hartree
zpe.sumelectthermalfe: -554.653657 hartree
dipole: 3.3948 0.1124 0.0001
dipole: 3.3966
quadrupole: -85.2583 -65.9151 -86.8093
quadrupole: -0.9600 0.0000 0.0000
quadrupole: -5.9307 13.4125 -7.4817 -0.9600 0.0000 0.0000
hfenergy: -554.7983182 hartree
pointgroup: C01 [X(C13H9N1)]
dipole: 1.3355902 0.0445338 0.0000219 debye
dipolederiv: -0.4461764 -0.0443526 -0.0000015 -0.1102129 -0.3158997 -0.0000035 -0.0000022 -0.0000013 -0.2508204 -0.0317724 -0.1055102 -0.0000006 -0.0628725 -0.0420303 -0.0000009 0.0000032 0. -0.008209 0.3444449 0.1124897 0.0000049 0.0014726 0.0308107 0.0000004 0.0000057 0.0000008 0.0231558 0.1123436 -0.1468987 0. -0.109399 -0.0352071 0. 0.0000005 -0.0000015 0.0590351 -0.2416611 0.2057906 -0.000004 0.2295236 -0.0810005 0.0000009 -0.0000052 0.0000006 0.0823296 -0.0395896 0.116807 0.0000003 -0.05485 0.1073142 -0.0000016 0. -0.0000011 -0.1736532 -0.0357438 -0.1228676 0.0000001 0.0670497 0.0948329 0.0000031 0.0000007 0.0000022 -0.1627847 -0.073671 0.101591 -0.0000002 0.0016514 0.042426 -0.0000029 -0.0000029 -0.0000042 -0.1408469 -0.0552023 0.1233878 0.0000018 0.1796608 0.0717072 0.0000021 0.0000027 0.0000039 -0.1723801 -0.2753039 -0.1837787 -0.0000046 -0.0500985 -0.0109249 0.0000008 -0.0000054 -0.0000024 -0.1097833 0.3693735 -0.1868436 0.0000055 -0.0906099 0.2577631 0.0000028 0.0000047 -0.0000007 -0.0823928 -0.0826175 -0.1101161 0.0000021 -0.0610482 0.0742638 -0.0000027 0.0000029 -0.0000029 -0.1585719 0.1203422 0.0262503 0.0000043 0.0359915 -0.0163109 0.0000005 0.0000029 0.0000005 -0.1521571 0.1682467 0.2144246 0.0000053 0.032605 0.2561152 0.0000041 0.0000108 0.0000112 -0.1004927 0.0187278 -0.1225293 -0.0000011 -0.0478405 -0.0566881 -0.0000003 -0.0000007 -0.0000003 0.1536647 0.0224207 0.1186212 -0.0000005 0.0450522 -0.0499318 -0.0000007 -0.0000002 -0.0000005 0.1551617 0.0602707 -0.1110547 0. -0.0510358 -0.0518532 0.0000009 -0.0000001 0.0000027 0.1444699 0.0668693 0.1167373 0.0000002 0.0475887 -0.0597692 -0.0000008 -0.0000001 0.0000003 0.1436477 0.0429411 -0.041372 -0.0000014 -0.1117311 -0.0760225 -0.0000015 -0.0000022 -0.0000021 0.1558947 0.053696 0.0498109 -0.0000007 0.0938926 -0.0929918 -0.0000004 -0.000001 -0.0000001 0.1267004 0.0154841 0.0883048 -0.0000028 0.1116249 -0.0642672 0.0000027 -0.0000024 0.0000024 0.1606323 -0.1419092 -0.002508 -0.0000042 -0.0034249 0.0946558 0.0000004 -0.0000044 0.0000001 0.1614991 0.0284865 -0.0963841 -0.0000029 -0.0929898 -0.0769918 -0.0000033 -0.0000072 -0.0000074 0.1459012 unknown
polarizability: 231.9477173|-0.9022199|159.1841667|0.0022045|0.0002093|55.6273263 unknown
InChI: InChI=1S/C13H9N/c1-2-4-12-10(3-1)5-6-11-9-14-8-7-13(11)12/h1-9H
charge 0 multiplicity 1
23 atoms
N  -3.606238 -0.304597 -0.000032
C  0.741837 -0.396056 0.000027
C  -0.721471 -0.402683 0.000009
C  1.43234 0.871554 0.000036
C  -1.432386 0.851485 0.000007
C  0.676601 2.106176 0.000031
C  -0.704399 2.099067 0.000018
C  1.520013 -1.59335 0.000035
C  2.861141 0.893569 0.00005
C  -1.515998 -1.589105 -0.000009
C  -2.863227 0.824591 -0.00001
C  2.920988 -1.548505 0.00006
C  3.599412 -0.295724 0.000064
C  -2.914594 -1.498272 -0.000022
H  1.229802 3.052868 0.000034
H  -1.272057 3.037043 0.000019
H  1.021513 -2.567913 0.000038
H  -1.053585 -2.580369 -0.000012
H  3.373431 1.863082 0.000058
H  -3.419698 1.770985 -0.000011
H  3.497213 -2.480068 0.000075
H  4.694327 -0.266861 0.00008
H  -3.534464 -2.401418 -0.000045
