program: Gaussian 09
title: 000123042
version: EM64L-G09RevD.01
frameworkgroup: C1[X(C26H16)]
method: RPBEPBE
basis: SDD
operation: Freq
keyword: #p
keyword: freq=noraman
keyword: PBEPBE/SDD
title: #p freq=noraman PBEPBE/SDD
converged: NO YES NO NO
title: Mulliken charges:
elementType: C C C C C C C C C C C C C C C C C C C C C C C C C C H H H H H H H H H H H H H H H H
charge: 0.237397 0.225855 0.483004 0.443187 0.436271 0.470731 -0.631222 -0.731193 -0.612729 -0.498860 0.420352 -0.495226 0.400198 -0.714493 -0.684206 -0.673943 0.403581 0.402170 -0.440229 -0.427663 -0.428826 -0.423523 -0.246246 -0.242846 -0.243980 -0.243027 0.232271 0.249454 0.229636 0.240018 0.239243 0.245866 0.248294 0.248959 0.242392 0.242477 0.241613 0.241266 0.228687 0.228732 0.228257 0.228301
chargesum: 0.00000
title: Mulliken charges with hydrogens summed into heavy atoms:
elementType: C C C C C C C C C C C C C C C C C C C C C C C C C C
charge: 0.237397 0.225855 0.483004 0.443187 0.436271 0.470731 -0.398951 -0.481739 -0.383094 -0.258842 0.420352 -0.255983 0.400198 -0.468627 -0.435912 -0.424984 0.403581 0.402170 -0.197837 -0.185186 -0.187213 -0.182257 -0.017559 -0.014114 -0.015722 -0.014726
polarizability: 7.30981296e+02 -2.09689081e+00 3.16315915e+02 1.35174037e-02 -2.89613296e-02 1.02571711e+02
1716.lowfreq: -6.3739 -3.3467 -0.0010 -0.0003 0.0008 9.3259 37.8793 46.0770 78.9930
frequency: 37.7349 46.0699 78.9896 82.9411 107.4979 161.1280 169.0161 188.5937 237.7194 238.7825 261.1829 312.9289 314.9008 334.2598 378.7222 395.0250 398.9479 408.8284 463.6708 467.9859 472.1573 477.3884 504.5407 513.9864 536.9382 548.2402 563.4799 578.1059 600.2548 622.9425 625.3832 648.1262 669.8624 717.8485 747.5814 752.6949 753.6544 753.6899 755.6683 780.7963 786.2899 793.5576 803.5355 815.0469 833.4681 842.7607 851.9115 860.5854 871.3880 896.4660 899.9912 907.3136 907.5448 927.7733 938.2278 950.4005 965.6921 967.7697 969.0083 986.4846 989.6842 990.3128 1012.6236 1019.5773 1103.5227 1123.4921 1142.7893 1170.5219 1171.9519 1186.8763 1193.5141 1195.8309 1208.9001 1215.2936 1246.7193 1257.4609 1274.4286 1278.8601 1286.1301 1301.6006 1310.8556 1327.0116 1346.8339 1383.1667 1398.8766 1412.8922 1426.7297 1429.3635 1433.8906 1436.5542 1445.7585 1451.7587 1468.3653 1480.9543 1508.2284 1535.2163 1558.0747 1566.7896 1577.5405 1600.0635 1616.1527 1627.5482 1636.6982 1641.7889 3113.9701 3115.2956 3116.3584 3117.9725 3118.6047 3119.0076 3119.0679 3123.9556 3124.2172 3127.2812 3138.0108 3141.8465 3142.0583 3142.5286 3160.9804 3161.2459
redmass: 4.9680 4.2032 5.2750 5.8043 4.5024 4.8446 4.3480 5.5829 4.1872 6.3245 4.7653 5.2421 4.0572 3.8465 6.3072 5.3228 3.3624 3.2892 2.4854 4.7426 2.4842 2.6669 7.3210 6.3944 3.5436 3.7219 3.2983 6.7941 6.5795 6.7132 6.8134 6.7105 3.4702 6.2304 5.9991 1.3215 5.5502 2.9211 1.2728 2.6453 5.1042 2.0995 1.9594 1.4160 3.7532 4.5880 1.3551 1.4351 1.5248 5.1044 1.5942 5.4779 1.7284 1.5438 2.1163 2.2048 1.4188 3.4211 1.4106 1.4188 1.3504 1.3964 2.3369 2.2609 2.4453 1.8912 1.5603 1.0971 1.0813 1.3345 1.3684 1.2933 1.6101 1.8052 2.1377 2.0012 2.2388 2.2355 1.6527 1.4824 3.0013 2.4973 2.1403 4.1269 2.3695 3.6652 3.6638 3.3721 5.0593 5.1651 3.3048 3.8472 2.7102 3.1232 4.6217 5.0577 6.9011 6.5269 5.5904 5.9078 6.3070 6.5078 6.8024 7.0777 1.0908 1.0899 1.0901 1.0893 1.0887 1.0867 1.0868 1.0891 1.0886 1.0907 1.0888 1.0948 1.0952 1.0982 1.1003 1.1003
irintensity: 0.4593 0.0119 0.0325 0.0971 1.2836 0.4257 0.1308 0.5597 0.0423 0.5365 0.1046 0.7231 1.9210 0.0649 3.0190 0.4519 2.1938 1.2390 0.1144 0.3021 29.6920 14.8103 0.4622 4.8493 0.9682 0.5830 0.2133 1.2287 5.8337 1.8945 0.7558 0.2535 6.1348 1.7298 0.8653 13.6618 0.0687 0.5369 119.5732 0.8381 0.2166 1.0246 1.7103 5.1417 2.3542 5.2191 0.1712 1.1513 5.6678 0.5076 11.8587 0.6853 20.4271 100.5460 20.1830 2.5361 12.5483 1.1426 23.5033 0.0270 0.0216 0.0303 6.6109 6.8327 0.2470 4.4402 13.1724 0.2655 0.6506 7.6499 6.4094 1.7514 0.1417 2.1136 8.2974 2.2942 1.0664 3.6338 2.3093 0.3417 0.6572 1.2055 1.5744 6.4965 5.2399 0.7540 1.2972 2.1395 0.7043 0.3028 9.5678 0.1647 0.9133 1.9827 31.2063 12.0760 1.5399 1.2813 0.7675 1.9124 0.4886 0.4059 1.5008 0.9798 4.5240 5.5267 9.9876 5.6410 2.5672 14.8609 6.5620 4.4479 1.2487 2.4304 7.2857 19.2538 32.2614 54.4303 93.7433 30.6378
temp: 298.150 k
press: 1.00000 atm
elementType: 6 6 6 6 6 6 6 6 6 6 6 6 6 6 6 6 6 6 6 6 6 6 6 6 6 6 1 1 1 1 1 1 1 1 1 1 1 1 1 1 1 1
symmnumber: 1
zpe: 864643.4 jmol-1
zpe.correction: 0.329325 hartree
zpe.thermalcorrener: 0.347097 hartree
zpe.thermalcorrenthalpy: 0.348041 hartree
zpe.thermalcorrgfe: 0.283830 hartree
zpe.sumelectzpe: -998.731682 hartree
zpe.sumelectthermal: -998.713910 hartree
zpe.sumelectthermalent: -998.712966 hartree
zpe.sumelectthermalfe: -998.777177 hartree
dipole: 0.0082 -0.0959 0.0000
dipole: 0.0963
quadrupole: -124.4736 -126.4065 -161.7788
quadrupole: -0.1462 0.0010 -0.0049
quadrupole: 13.0793 11.1465 -24.2258 -0.1462 0.0010 -0.0049
hfenergy: -999.061007 hartree
pointgroup: C01 [X(C26H16)]
dipole: 0.0032246 0.0377388 0.0000152 debye
polarizability: 730.9830145|1.9194292|316.3141961|-0.0135298|-0.0289555|102.5717106 unknown
InChI: InChI=1S/C26H16/c1-2-7-19-13-24-16-26-22(14-23(24)12-18(19)6-1)10-9-21-11-17-5-3-4-8-20(17)15-25(21)26/h1-16H
charge 0 multiplicity 1
42 atoms
C  0.436997 -0.563645 0.000192
C  1.90244 -0.354264 0.000148
C  -0.083084 -1.933257 0.00043
C  -1.900643 0.282372 0.000129
C  -2.413079 -1.088244 0.00038
C  2.782687 -1.516556 0.000279
C  -0.484252 0.49285 0.000041
C  -1.468498 -2.159783 0.000514
C  2.492438 0.922768 0.000018
C  0.846957 -3.050252 0.000549
C  3.905488 1.113548 -0.000031
C  2.207705 -2.852709 0.000463
C  4.776834 -0.049382 0.000073
C  4.179838 -1.340969 0.00023
C  -2.822275 1.361692 -0.000026
C  -3.816005 -1.303863 0.00047
C  -4.220973 1.145808 0.000069
C  -4.732431 -0.225951 0.000327
C  4.497804 2.42231 -0.000174
C  6.199827 0.145592 0.000028
C  -5.165158 2.235674 -0.000078
C  -6.159731 -0.432324 0.000423
C  5.88457 2.579699 -0.00022
C  6.743608 1.430782 -0.000108
C  -6.535443 1.995373 0.000016
C  -7.038494 0.646006 0.000269
H  -0.1341 1.530942 -0.000149
H  -1.838143 -3.193116 0.000689
H  1.864234 1.820536 -0.000041
H  0.433071 -4.065632 0.000699
H  2.893216 -3.708526 0.000536
H  4.826844 -2.227565 0.000328
H  -2.44068 2.390851 -0.00021
H  -4.198338 -2.332668 0.000663
H  3.84159 3.301112 -0.000245
H  6.855203 -0.733769 0.000106
H  -4.782751 3.263597 -0.000276
H  -6.542666 -1.459999 0.000619
H  6.324231 3.583163 -0.000331
H  7.830485 1.568793 -0.000139
H  -7.241457 2.833191 -0.000105
H  -8.120665 0.474814 0.000345
