program: Gaussian 09
title: 000123033
version: EM64L-G09RevD.01
frameworkgroup: C1[X(C34H18)]
method: RPBEPBE
basis: SDD
operation: Freq
keyword: #p
keyword: freq=noraman
keyword: PBEPBE/SDD
title: #p freq=noraman PBEPBE/SDD
converged: YES YES NO YES
title: Mulliken charges:
elementType: C C C C C C C C C C C C C C C C C C C C C C C C C C C C C C C C C C H H H H H H H H H H H H H H H H H H
charge: -0.080629 -0.080553 0.045768 0.046024 0.269800 0.270020 -0.076446 -0.076389 0.223934 0.223866 0.261047 0.261020 0.174413 0.174143 0.467614 0.467649 -0.458496 -0.458782 -0.510063 -0.510290 -0.417087 -0.417088 -0.435542 -0.435297 -0.478643 -0.478663 -0.390465 -0.390440 -0.270971 -0.270961 -0.274505 -0.274358 -0.275174 -0.275177 0.292052 0.292214 0.237686 0.237695 0.230792 0.230777 0.297820 0.297665 0.242909 0.242915 0.229866 0.229852 0.229539 0.229538 0.233000 0.232993 0.231704 0.231705
chargesum: 0.00000
title: Mulliken charges with hydrogens summed into heavy atoms:
elementType: C C C C C C C C C C C C C C C C C C C C C C C C C C C C C C C C C C
charge: -0.080629 -0.080553 0.045768 0.046024 0.269800 0.270020 -0.076446 -0.076389 0.223934 0.223866 0.261047 0.261020 0.174413 0.174143 0.467614 0.467649 -0.166444 -0.166568 -0.272377 -0.272595 -0.186296 -0.186311 -0.137722 -0.137632 -0.235734 -0.235748 -0.160599 -0.160588 -0.041431 -0.041423 -0.041505 -0.041364 -0.043470 -0.043472
polarizability: 6.99635494e+02 -2.62789175e+01 4.95236515e+02 -8.72469540e-04 3.43361721e-03 1.71689947e+02
1716.lowfreq: -6.6419 -4.8421 -4.2337 -0.0004 0.0001 0.0002 36.8488 42.4511 72.8189
frequency: 36.8330 42.4475 72.8169 89.3646 94.5052 122.1751 130.7384 160.4418 178.0539 211.2047 214.1093 262.0394 267.1037 271.1566 280.7040 284.4968 311.9870 331.2781 353.9755 391.3085 403.8978 419.3901 425.1889 433.0319 441.4369 455.4485 466.9707 491.8711 516.9923 521.8478 523.8855 535.3849 544.7973 547.7217 552.0127 571.2949 603.9478 605.1032 626.4702 626.6908 635.0424 640.3314 657.5103 663.5081 693.4429 720.3371 723.3507 725.8861 751.6047 760.3680 766.1151 769.2879 771.7331 775.8670 805.9298 810.7542 811.1586 815.5197 839.3438 852.6717 853.4560 856.1193 880.2480 881.2804 911.2979 913.2868 919.8903 937.4175 948.7533 958.0561 960.1908 976.1568 980.5151 982.8847 986.0204 1011.8092 1012.7160 1029.7533 1049.2506 1051.4903 1074.6710 1075.6492 1086.4941 1089.3009 1128.1996 1132.8246 1159.5335 1161.3708 1180.2912 1181.4050 1194.6233 1206.3217 1208.1583 1209.2706 1242.1670 1246.1884 1261.7551 1263.0233 1281.4559 1301.9060 1307.2227 1330.8462 1340.5802 1357.0747 1365.0458 1379.5336 1385.9067 1391.6587 1396.0460 1403.1653 1414.2683 1423.5911 1423.8689 1427.7172 1449.7846 1467.6743 1470.6922 1471.0690 1476.8535 1480.5335 1508.3949 1532.6318 1541.6881 1572.4987 1573.4559 1577.5060 1598.2937 1599.3211 1611.1471 1611.3168 1616.5518 1624.8811 3126.2238 3126.3063 3129.0585 3129.1828 3130.1422 3130.3957 3143.0242 3143.1909 3147.7479 3148.0115 3158.9055 3159.1457 3164.9769 3165.5648 3169.1998 3169.4835 3173.9729 3174.3882
redmass: 5.4356 5.3159 4.7788 4.5693 4.9097 4.6705 4.1115 5.5859 5.3486 4.2126 4.1060 5.9248 4.6164 4.7615 4.9408 6.1813 5.9397 4.9677 6.0633 6.1920 6.1432 5.0032 6.8370 4.7906 3.5857 3.9227 4.8110 4.6453 3.8735 3.7813 3.7797 4.8906 5.8552 6.7062 5.5788 4.0308 3.4972 6.9810 6.6102 5.0103 4.9699 6.3645 4.1758 6.5619 4.5342 2.4571 6.4493 5.5923 2.6939 3.0387 1.5902 2.0649 1.3160 2.5870 5.8896 2.1660 3.2481 3.6855 4.9469 3.9503 1.7866 2.5188 1.5297 1.3778 1.5341 1.4709 6.1643 5.5317 6.1453 1.3869 1.3937 1.3577 1.3593 1.3466 1.3521 1.3103 1.2891 5.7681 2.7653 2.2589 2.9769 3.3016 2.1303 2.1386 1.9971 2.0277 1.3592 1.4502 1.1346 1.0943 1.4659 1.5303 1.4166 1.6233 1.8566 1.8693 1.7193 2.0564 1.9475 2.6147 2.2026 5.0504 2.4768 3.6856 4.0901 8.1443 3.0206 6.5715 4.9634 6.0876 3.0549 2.9722 4.1993 2.1081 3.3353 4.2515 3.3332 2.4825 3.4865 5.0629 3.4438 4.7149 6.1493 5.8215 6.9859 7.6391 6.1498 6.4675 5.8342 6.2420 6.5866 7.2964 1.0870 1.0871 1.0874 1.0880 1.0855 1.0861 1.0909 1.0909 1.0913 1.0912 1.0956 1.0955 1.0973 1.0975 1.0944 1.0945 1.0969 1.0967
irintensity: 0.0307 0.3172 0.0255 0.7371 2.4973 0.4504 0.0183 0.1631 1.3754 0.4495 0.0090 4.8391 1.2269 0.8078 0.7089 0.1656 0.2565 0.4793 0.5343 0.4154 0.6571 0.0000 0.8367 0.0821 0.4851 1.6495 1.0376 2.9605 0.2421 0.8343 1.5970 3.0464 2.3275 1.0247 2.2457 0.5028 24.1279 2.3331 0.1478 0.1370 6.0831 1.1080 0.6999 3.3709 6.8131 0.6079 13.7736 0.2044 3.2587 0.4595 15.1084 12.1389 202.6285 14.7034 0.4013 3.4806 3.8088 2.2367 1.4756 29.9849 4.5492 44.0615 3.5341 9.1203 11.4839 2.0947 1.8453 4.1489 0.0408 1.7336 0.0662 0.6606 0.4951 1.2708 2.3752 0.0746 1.0853 6.4505 10.8862 2.3635 0.1445 6.6875 7.9058 0.5137 2.0283 0.1043 4.3954 0.0396 2.9089 0.4536 11.7956 0.3036 9.7191 0.3735 0.3357 0.2315 0.6775 1.1229 0.9570 0.0275 10.1724 0.5047 0.0020 21.1569 1.0620 0.1367 8.9660 3.1547 0.0056 8.5937 2.0522 2.5621 17.9045 8.1587 0.4937 0.3459 21.0549 3.7636 9.8419 0.8409 1.5336 0.9634 2.9349 4.7712 0.2454 0.0861 0.7967 9.5162 0.6101 0.0363 0.1094 1.6220 2.5819 0.0922 1.2294 14.7645 0.7294 0.0675 5.1103 61.7455 22.3233 0.0112 0.3720 19.9871 12.6836 12.1114 0.6661 93.8955 60.5893 2.5237
temp: 298.150 k
press: 1.00000 atm
elementType: 6 6 6 6 6 6 6 6 6 6 6 6 6 6 6 6 6 6 6 6 6 6 6 6 6 6 6 6 6 6 6 6 6 6 1 1 1 1 1 1 1 1 1 1 1 1 1 1 1 1 1 1
symmnumber: 1
zpe: 1052802.5 jmol-1
zpe.correction: 0.400991 hartree
zpe.thermalcorrener: 0.422981 hartree
zpe.thermalcorrenthalpy: 0.423925 hartree
zpe.thermalcorrgfe: 0.351792 hartree
zpe.sumelectzpe: -1304.355746 hartree
zpe.sumelectthermal: -1304.333756 hartree
zpe.sumelectthermalent: -1304.332812 hartree
zpe.sumelectthermalfe: -1304.404945 hartree
dipole: -0.0002 0.0005 0.0921
dipole: 0.0921
quadrupole: -162.1487 -167.2425 -201.6280
quadrupole: 0.3554 -0.0022 0.0006
quadrupole: 14.8577 9.7639 -24.6216 0.3554 -0.0022 0.0006
hfenergy: -1304.7567372 hartree
pointgroup: C01 [X(C34H18)]
dipole: 0.0000948 -0.0002142 0.0362425 debye
polarizability: 699.8438376|-25.4549203|495.0281723|0.0008863|-0.0034301|171.6899473 unknown
InChI: InChI=1S/C34H18/c1-3-11-25-21(9-1)23-13-5-7-19-15-18-28-32-26-12-4-2-10-22(26)24-14-6-8-20-16-17-27(34(32)30(20)24)31(25)33(28)29(19)23/h1-18H
charge 0 multiplicity 1
52 atoms
C  -1.281718 0.624545 -0.123534
C  1.281648 -0.624224 -0.123579
C  -1.199295 -0.797691 0.054248
C  1.199281 0.798042 0.054089
C  -0.076501 1.424343 -0.179068
C  0.076433 -1.424017 -0.178812
C  -2.57753 1.252218 -0.300437
C  2.577397 -1.252009 -0.300499
C  -2.417254 -1.532342 0.424251
C  2.417328 1.532544 0.424275
C  -3.79116 0.485277 -0.189038
C  3.791061 -0.485104 -0.189381
C  -3.706911 -0.910682 0.269418
C  3.706938 0.910826 0.26916
C  -2.652857 2.649775 -0.650576
C  2.652623 -2.649669 -0.650269
C  -0.199507 2.816385 -0.555586
C  0.199303 -2.816247 -0.554622
C  -1.42901 3.399385 -0.794338
C  1.428743 -3.399349 -0.793445
C  -5.028978 1.122952 -0.463816
C  5.02882 -1.122879 -0.464183
C  -2.358221 -2.821184 1.043355
C  2.358518 2.821019 1.0442
C  -3.915871 3.251797 -0.902303
C  3.915584 -3.251789 -0.902034
C  -4.873443 -1.647869 0.628936
C  4.873581 1.647794 0.628764
C  -5.092527 2.488631 -0.816865
C  5.092272 -2.488632 -0.816968
C  -3.518898 -3.520845 1.402566
C  3.519297 3.52045 1.403528
C  -4.792164 -2.940673 1.166107
C  4.792489 2.940372 1.166486
H  0.710654 3.395242 -0.728724
H  -0.710946 -3.395193 -0.727083
H  -1.490257 4.442172 -1.126597
H  1.489912 -4.442285 -1.125247
H  -5.962842 0.557287 -0.406316
H  5.962718 -0.557254 -0.406834
H  -1.383839 -3.248758 1.29135
H  1.384255 3.24842 1.292895
H  -3.957089 4.312156 -1.176632
H  3.956735 -4.31223 -1.176059
H  -5.86034 -1.189966 0.518039
H  5.86042 1.189825 0.517617
H  -6.064085 2.949793 -1.024122
H  6.06379 -2.949882 -1.024217
H  -3.4397 -4.500728 1.885501
H  3.440237 4.500052 1.887058
H  -5.705164 -3.481029 1.438614
H  5.705568 3.480527 1.439127
