program: Gaussian 09
title: 000123012
version: EM64L-G09RevD.01
frameworkgroup: C1[X(C15H18O5)]
method: RPBEPBE
basis: SDD
operation: Freq
keyword: #pfreq=noraman
keyword: PBEPBE/SDD
title: #p freq=noraman PBEPBE/SDD
converged: YES YES NO NO
title: Mulliken charges:
elementType: O O O O O C C C C C C C C C C C C C C C H H H H H H H H H H H H H H H H H H
charge: -0.189405 -0.435985 -0.400306 -0.187865 -0.233908 0.053236 0.104088 -0.607121 -0.332537 0.235858 -0.148133 -0.548385 0.378099 0.139556 0.370769 -0.543456 -0.498107 -0.762314 -0.735871 -0.212820 0.303077 0.271808 0.300479 0.232376 0.255299 0.221450 0.216298 0.249731 0.266835 0.220987 0.206662 0.216916 0.256152 0.207436 0.208702 0.340164 0.197845 0.382389
chargesum: 0.00000
title: Mulliken charges with hydrogens summed into heavy atoms:
elementType: O O O O O C C C C C C C C C C C C C C C
charge: -0.189405 -0.095821 -0.017918 -0.187865 -0.233908 0.053236 0.104088 -0.032236 -0.032059 0.235858 0.084243 -0.071636 0.378099 0.139556 0.370769 -0.077427 -0.231272 -0.117748 -0.063580 -0.014975
polarizability: 2.18622517e+02 1.23627244e+01 1.61582791e+02 -1.00530195e+01 -1.54662357e+00 1.31429631e+02
1716.lowfreq: -8.7344 -3.3720 0.0004 0.0006 0.0007 6.8907 29.0637 57.7240 74.2549
frequency: 28.4136 57.7157 74.2523 116.7474 129.3724 133.9626 167.4874 189.3405 192.9572 210.7983 214.3440 232.5913 240.4990 272.1403 287.4414 300.5010 334.1542 339.4892 351.6400 368.4591 382.2049 395.4935 413.1794 450.8729 471.6869 496.7268 519.0141 538.6113 565.0311 575.5527 611.7088 625.5440 635.0565 697.2509 712.5734 761.0467 766.8115 792.7059 799.5724 837.9475 875.0702 888.4625 902.0708 910.6238 915.8484 929.2409 932.4749 941.6782 947.5489 972.6651 977.6096 989.0432 1002.8937 1036.6113 1044.2508 1048.3016 1054.4194 1079.2297 1113.7819 1137.3109 1157.1758 1171.5293 1198.9612 1209.7797 1225.1037 1237.5778 1243.5828 1258.7909 1272.4358 1295.4933 1307.7090 1310.5360 1315.7152 1338.1602 1345.4258 1347.3224 1365.5755 1380.6797 1399.8520 1433.5394 1443.4812 1457.1028 1459.9107 1466.0271 1479.2756 1480.2640 1488.7167 1571.4865 1620.1932 1708.1675 2925.5130 2966.3641 2970.8559 2977.9633 2985.2542 2992.6261 3013.3781 3059.5512 3063.0181 3065.8411 3071.3303 3073.1004 3092.7234 3099.7752 3105.3204 3208.7570 3396.6290 3530.1641
redmass: 3.5047 4.8997 8.8306 6.8040 3.5463 5.2773 5.6149 2.3012 1.5035 3.8016 1.3825 3.4794 3.5956 1.8892 4.2425 3.5412 3.6572 3.2810 1.2383 3.3059 2.2806 3.5643 2.3357 2.9043 3.6954 3.8529 2.8892 2.3484 3.1956 2.6710 3.9645 3.9995 5.5968 6.9794 4.3544 4.3734 4.3057 3.8680 4.3812 2.8733 1.6095 4.4558 3.0332 1.9676 2.0398 1.7646 2.9243 1.5714 1.7856 1.8000 1.8797 2.6059 1.9608 1.9751 2.3944 3.7864 2.6999 1.6993 1.5806 2.6974 1.5915 2.8434 1.8682 2.5941 1.7831 1.2336 1.8668 1.6487 1.5787 1.9447 1.4910 1.4386 1.6994 2.0707 1.9591 1.5195 1.3420 1.2071 1.1998 2.4720 1.1013 1.3055 1.0902 1.0615 1.0833 1.0562 1.0556 7.7460 8.2522 12.8559 1.0876 1.0359 1.0860 1.0375 1.0633 1.0637 1.0830 1.0996 1.0996 1.0997 1.0989 1.0988 1.0990 1.0559 1.0897 1.1173 1.0647 1.0663
irintensity: 2.1374 0.1161 3.5847 5.6466 0.8090 1.2955 6.0652 5.9500 3.5696 2.6828 0.1148 9.2374 2.6606 0.4166 4.8331 1.9395 2.3038 1.2198 116.9190 1.2917 0.1208 1.1061 1.4723 1.0065 6.7116 14.7875 17.4535 77.9262 29.3031 39.8628 12.1396 7.4161 4.4295 23.4897 10.1863 21.5202 2.8719 2.6041 3.1659 21.1696 2.7596 92.7329 17.4250 10.2046 3.6340 14.0720 123.6397 7.0948 9.0217 1.3170 17.7625 54.8833 44.0711 49.8833 52.4877 34.8110 7.7482 32.2163 8.4049 6.2048 24.7573 30.0495 3.7677 62.3521 34.4245 89.8743 15.5137 15.7065 1.9823 5.2618 33.2708 65.3602 10.7965 9.8296 20.7321 59.8478 8.4461 20.7969 14.9946 29.7940 7.5774 7.9068 1.7930 6.1214 14.0301 9.1704 13.2205 244.0022 77.3370 309.3582 86.6501 30.7823 44.5450 44.9834 16.0402 21.7387 5.3769 17.9516 6.4583 7.9681 56.3730 42.7355 23.5259 5.9182 4.9988 0.8634 113.5637 13.6448
temp: 298.150 k
press: 1.00000 atm
elementType: 8 8 8 8 8 6 6 6 6 6 6 6 6 6 6 6 6 6 6 6 1 1 1 1 1 1 1 1 1 1 1 1 1 1 1 1 1 1
symmnumber: 1
zpe: 792991.2 jmol-1
zpe.correction: 0.302034 hartree
zpe.thermalcorrener: 0.320634 hartree
zpe.thermalcorrenthalpy: 0.321578 hartree
zpe.thermalcorrgfe: 0.256671 hartree
zpe.sumelectzpe: -956.964296 hartree
zpe.sumelectthermal: -956.945696 hartree
zpe.sumelectthermalent: -956.944751 hartree
zpe.sumelectthermalfe: -957.009659 hartree
dipole: 4.4569 -5.4862 0.4049
dipole: 7.0800
quadrupole: -136.4716 -131.1553 -113.9803
quadrupole: 7.9487 7.1350 3.8499
quadrupole: -9.2692 -3.9529 13.2221 7.9487 7.1350 3.8499
hfenergy: -957.2663299 hartree
pointgroup: C01 [X(C15H18O5)]
dipole: -1.715825 -2.1893393 -0.147571 debye
polarizability: 218.9251599|-11.345058|161.1648711|-10.5677553|1.4063977|131.5449083 unknown
InChI: InChI=1S/C15H18O5/c1-12(2)4-9-13(19,6-12)3-8(5-16)14-7-15(9,14)11(18)20-10(14)17/h3,5,9-10,17,19H,4,6-7H2,1-2H3
charge 0 multiplicity 1
38 atoms
O  2.439137 2.053712 0.402358
O  -1.647807 -1.06239 2.087378
O  3.878297 0.572329 -0.714738
O  0.489142 3.297418 0.697513
O  3.422726 -2.242875 -0.422608
C  0.374121 0.978369 -0.175796
C  1.502257 -0.060145 -0.262502
C  0.938546 0.550343 -1.549747
C  -1.033434 0.627984 0.293082
C  -1.258664 -0.900335 0.647281
C  2.798004 0.619638 0.223343
C  -2.158303 0.990817 -0.720093
C  1.184973 -1.468565 0.087571
C  1.027487 2.240444 0.339173
C  -3.30882 -0.030804 -0.477814
C  -2.506284 -1.332604 -0.167756
C  -0.083655 -1.83685 0.46342
C  -4.200043 -0.198725 -1.729159
C  -4.186007 0.388582 0.731701
C  2.243831 -2.489873 -0.025252
H  1.582219 1.246974 -2.094392
H  0.305646 -0.092208 -2.168866
H  -1.217132 1.196615 1.224076
H  3.111708 0.250353 1.222019
H  -2.486721 2.038063 -0.602266
H  -1.779393 0.879071 -1.754634
H  -2.18063 -1.797734 -1.11944
H  -3.085652 -2.082296 0.398658
H  -0.299185 -2.889629 0.697613
H  -4.718527 0.747902 -1.971104
H  -3.604942 -0.494183 -2.614413
H  -4.975739 -0.970474 -1.566095
H  -3.590731 0.482851 1.655165
H  -4.684114 1.35524 0.52936
H  -4.972308 -0.366093 0.92062
H  -0.897402 -0.747047 2.656877
H  1.952185 -3.529389 0.255051
H  4.060716 -0.401589 -0.861481
