program: Gaussian 09
title: 000123009
version: EM64L-G09RevD.01
frameworkgroup: C1[X(C6H12O6S)]
method: RPBEPBE
basis: SDD
operation: Freq
keyword: #p
keyword: freq=noraman
keyword: PBEPBE/SDD
title: #p freq=noraman PBEPBE/SDD
converged: YES YES NO NO
title: Mulliken charges:
elementType: S O O O O O O C C C C C C H H H H H H H H H H H H
charge: 1.193494 -0.322221 -0.376708 -0.569711 -0.553923 -0.472350 -0.498104 -0.003249 -0.274458 -0.342637 -0.303163 -0.060615 -0.542159 0.251762 0.215190 0.208285 0.260287 0.234338 0.411507 0.210488 0.207850 0.240566 0.433304 0.229647 0.222581
chargesum: 0.00000
title: Mulliken charges with hydrogens summed into heavy atoms:
elementType: S O O O O O O C C C C C C
charge: 1.193494 -0.322221 -0.376708 -0.158203 -0.120619 -0.472350 -0.498104 0.248513 0.149016 0.151988 0.115174 0.179951 -0.089931
polarizability: 1.52244579e+02 5.84779177e+00 1.04114195e+02 -6.04785585e+00 -1.91794659e+00 9.11226030e+01
1716.lowfreq: -3.1754 0.0019 0.0019 0.0026 3.3227 4.3821 26.7197 47.2213 51.5664
frequency: 26.4420 47.1904 51.4173 79.3703 90.3907 104.4823 143.7204 176.0103 187.6661 198.0268 230.0355 266.5909 298.0579 324.7161 347.1041 364.1991 395.6777 432.0607 453.4613 460.9541 483.9706 562.4989 601.9259 629.2744 643.2508 815.7965 862.6166 886.8869 896.3594 921.7841 928.0778 947.1524 966.4902 976.3529 1002.9159 1008.0038 1034.3805 1051.2720 1080.6539 1096.8662 1152.0778 1184.9387 1220.0482 1230.8097 1253.4742 1282.3963 1290.4756 1330.3776 1342.5746 1376.5641 1392.7606 1431.7177 1435.5777 1465.0379 1468.3438 1479.8965 1665.2930 2484.7292 2938.7357 2950.9465 2980.7121 3002.7841 3007.9394 3027.2983 3057.5281 3094.8300 3124.2030 3205.7036 3440.7605
redmass: 6.0415 5.2410 3.0367 5.7554 2.8637 3.4403 4.4691 7.7498 8.5208 3.3912 3.3535 6.9231 8.1053 7.2704 12.0844 3.4096 5.8289 2.8302 2.2274 3.6059 6.9262 2.5582 1.1550 11.9197 1.7208 3.5912 12.3869 3.6654 1.1263 1.4783 2.1566 4.0984 1.3891 1.6901 11.2022 1.2558 6.5132 2.2845 2.0950 4.1040 1.6882 1.1740 1.2184 1.1466 1.0958 1.2332 1.2278 1.2251 1.1758 1.3832 1.5432 1.0799 1.1991 1.0880 1.1041 1.0822 4.7329 1.0749 1.0573 1.0566 1.0607 1.1043 1.0961 1.0954 1.1028 1.0610 1.0947 1.1145 1.0646
irintensity: 0.2918 0.4057 0.9344 0.6137 1.3934 3.1562 15.4018 3.6929 0.5331 2.5814 4.6476 6.3451 2.7438 5.4496 17.0415 4.5163 15.2769 20.4085 4.5004 26.0032 68.5249 45.4796 146.5534 76.4461 2.9282 19.2320 114.6198 19.8963 138.6370 2.6119 15.5380 116.7254 92.7759 3.6652 113.9667 49.5590 142.4698 39.5790 8.2837 14.5320 1.1584 20.2109 4.5203 8.6358 11.6960 5.7347 32.9939 15.2505 19.7377 4.4489 0.6039 25.3505 26.6298 26.4674 114.0203 54.5636 1.6173 1627.5646 36.6607 52.6358 18.0386 41.1840 4.2279 42.2162 9.6832 8.0389 7.5473 20.8420 172.4021
temp: 298.150 k
press: 1.00000 atm
elementType: 16 8 8 8 8 8 8 6 6 6 6 6 6 1 1 1 1 1 1 1 1 1 1 1 1
symmnumber: 1
zpe: 486836.1 jmol-1
zpe.correction: 0.185426 hartree
zpe.thermalcorrener: 0.200771 hartree
zpe.thermalcorrenthalpy: 0.201715 hartree
zpe.thermalcorrgfe: 0.141327 hartree
zpe.sumelectzpe: -1083.938625 hartree
zpe.sumelectthermal: -1083.923280 hartree
zpe.sumelectthermalent: -1083.922336 hartree
zpe.sumelectthermalfe: -1083.982724 hartree
dipole: -10.0607 3.2162 0.8221
dipole: 10.5942
quadrupole: -97.6896 -81.3778 -88.8339
quadrupole: 3.3156 -0.6323 0.9066
quadrupole: -8.3892 7.9226 0.4665 3.3156 -0.6323 0.9066
hfenergy: -1084.124051 hartree
pointgroup: C01 [X(C6H12O6S1)]
dipole: -3.9164518 1.374059 0.3826006 debye
dipolederiv: 2.0221961 -0.080567 0.1031157 -0.2518819 1.6005673 0.0519522 0.333194 -0.0421051 1.4473282 -1.4061576 -0.1840938 0.0585339 -0.0646526 -0.4555386 0.0178172 0.0733243 -0.0216922 -0.4013765 -1.0006129 0.2845792 -0.0759823 0.3077552 -0.6085997 0.0229093 0.0043913 0.0315237 -0.4192154 -0.9738044 0.0618241 0.037156 0.2066933 -0.7502415 0.0148901 0.1500455 0.0022247 -0.4876642 -1.2207324 -0.2358895 -0.1711202 -0.017118 -0.6599107 -0.0388829 -0.1101614 -0.0437453 -0.5512817 -0.6877035 0.0733867 0.0236013 0.0514848 -0.4117785 -0.0077652 0.0908418 -0.0234331 -0.4629584 -0.5588434 0.014231 0.0374257 0.0725525 -0.4779425 -0.0049647 -0.129403 0.0571501 -0.6733458 0.0747277 0.0223585 -0.0133053 -0.0249624 0.4858757 -0.0893162 -0.0156484 -0.1213805 0.3281813 0.5316526 0.1676734 0.0896308 0.2198661 0.3911085 -0.0497088 0.1625519 0.0219652 0.3158374 0.6967346 -0.2511016 0.0302801 0.1455276 0.125254 0.0118595 -0.1591856 0.1317615 0.1351306 1.059109 0.0956821 -0.1244613 -0.1085999 0.3376757 -0.084154 -0.2405366 -0.0358977 0.3307016 -0.2009839 0.1240165 0.0459069 0.1309634 -0.0748217 -0.0114619 0.1160972 -0.0080777 0.12713 -0.2548159 0.1346934 0.0764116 0.1679707 -0.1912504 0.009118 0.0320386 0.0045399 0.0828579 0.0605903 0.0001127 0.0035225 0.013011 -0.0130042 0.0187948 -0.0051515 0.0504963 -0.1066664 -0.0122765 0.0413969 -0.0193167 -0.029097 -0.160111 0.0358927 -0.0323794 0.0619131 0.0494418 -0.003587 -0.0309202 -0.0049033 -0.0641003 0.0305325 0.028699 -0.0585932 -0.0464633 -0.1677206 0.0164869 0.0258523 -0.009194 -0.0530299 0.1313532 0.06314 0.0388911 -0.0158455 -0.0293744 -0.0220495 0.121365 0.0117531 0.0336144 -0.0790815 -0.0118175 0.0217978 -0.0028264 0.1192096 0.488533 -0.0509798 -0.0667342 -0.1110143 0.3229542 0.0348222 -0.0638065 0.0179181 0.343932 -0.0406375 -0.0138059 -0.0263408 0.0119515 0.0582086 0.0504907 0.0461934 0.0062604 -0.1723958 -0.1004246 -0.0421 0.0228049 0.0837934 -0.1830364 0.0157524 0.026794 0.0517441 0.0602009 0.1472989 -0.036169 -0.0070731 -0.0843589 0.0824709 0.0256998 -0.0512868 -0.0045025 -0.0924797 1.1816446 -0.0757069 0.086847 -0.440276 0.2961561 -0.0585456 -0.1407139 -0.0453198 0.2813239 0.0582431 -0.1222577 -0.0626775 -0.1478641 0.0703651 -0.0399759 -0.0673532 -0.0469312 0.0463941 0.1454125 -0.0435802 -0.0458809 -0.0482284 0.1327949 -0.0052449 -0.0219415 0.0207232 -0.1031902 unknown
polarizability: 152.5344475|4.5709371|103.9094677|-6.0684729|-1.2679639|91.0374622 unknown
InChI: InChI=1S/C6H12O6S/c1-2-3-11-4-6(7)5-12-13(8,9)10/h2,6-8H,1,3-5H2
charge 0 multiplicity 1
25 atoms
S  3.333116 -0.638867 0.087097
O  -2.307111 0.273423 -0.330806
O  2.494464 0.951916 -0.546782
O  0.055266 -0.781838 -0.235974
O  2.318259 -1.860809 -0.678226
O  4.766887 -0.658566 -0.605172
O  3.147919 -0.650916 1.689998
C  0.030757 0.685975 -0.445724
C  -1.281221 1.201523 0.169079
C  1.277195 1.293664 0.206494
C  -3.638693 0.469927 0.292995
C  -4.603274 -0.476844 -0.368738
C  -5.376097 -1.363188 0.30534
H  0.04489 0.88211 -1.535399
H  -1.490723 2.239739 -0.159879
H  -1.23978 1.166297 1.27918
H  1.369665 0.972641 1.264256
H  1.231117 2.398134 0.16878
H  -0.884641 -1.100261 -0.341303
H  -3.572867 0.286294 1.385481
H  -3.945426 1.5259 0.127894
H  -4.666993 -0.399583 -1.462328
H  1.318022 -1.53627 -0.531995
H  -6.088248 -2.011945 -0.215573
H  -5.323982 -1.463955 1.396603
