program: Gaussian 09
title: 000122983
version: EM64L-G09RevD.01
frameworkgroup: C1[X(C10H20N2O4)]
method: RPBEPBE
basis: SDD
operation: Freq
keyword: #p
keyword: freq=noraman
keyword: PBEPBE/SDD
title: #p freq=noraman PBEPBE/SDD
converged: YES YES NO NO
title: Mulliken charges:
elementType: O O O O N N C C C C C C C C C C H H H H H H H H H H H H H H H H H H H H
charge: -0.280833 -0.217440 -0.217894 -0.215033 -0.050682 0.124820 -0.042778 -0.362701 -0.357455 -0.335863 -0.338006 -0.341232 -0.694762 -0.691196 0.311143 -0.758737 0.294463 0.218380 0.201972 0.244264 0.213010 0.192060 0.239027 0.219610 0.205149 0.204009 0.190829 0.215322 0.222853 0.211344 0.219161 0.220265 0.207239 0.246664 0.250454 0.252576
chargesum: 0.00000
title: Mulliken charges with hydrogens summed into heavy atoms:
elementType: O O O O N N C C C C C C C C C C
charge: -0.280833 -0.217440 -0.217894 -0.215033 -0.050682 0.124820 0.251685 0.057651 0.099819 0.095225 0.086753 0.053606 -0.045244 -0.044531 0.311143 -0.009044
polarizability: 1.52860665e+02 1.03924334e+00 1.39580784e+02 1.76862577e+00 -7.02582070e+00 1.28985347e+02
1716.lowfreq: -33.5951 -8.5892 0.0004 0.0007 0.0008 1.2083 6.5771 17.9783 21.0628
frequency: -33.4850 17.0064 20.7185 40.9718 60.0155 66.1125 66.3936 71.1807 84.7267 91.4604 130.5966 150.7492 176.9803 208.2127 228.0515 234.8860 237.7738 270.0736 288.4913 307.9610 349.6184 384.7498 423.6452 470.2481 502.2237 560.0901 603.9234 626.5812 662.6120 668.6157 731.5101 731.8836 781.3732 792.0881 818.6956 875.9512 900.4980 902.9787 905.0657 914.6705 977.2069 995.6110 1013.7963 1038.3249 1040.7454 1068.1509 1072.1557 1109.2929 1112.1300 1133.0254 1149.8632 1172.6088 1192.0119 1208.6860 1231.3617 1244.9363 1267.9539 1276.0176 1288.1975 1291.3281 1314.8369 1325.7659 1344.6571 1349.9115 1360.4072 1374.9155 1383.3641 1392.5019 1393.1759 1407.5204 1445.5394 1450.2949 1452.9903 1453.3178 1466.3412 1474.5701 1474.7641 1478.0333 1479.2765 1485.7150 1486.7711 1670.1230 2965.2535 2975.7140 2976.8935 2980.2820 2989.1678 2997.7639 3006.8042 3010.7329 3013.8977 3028.5902 3048.9700 3057.0238 3063.1027 3072.1247 3075.5246 3077.6998 3078.9458 3084.4444 3094.0465 3144.1903
redmass: 1.0983 5.0829 6.2036 3.4541 2.5115 1.7928 2.9316 2.4282 3.0492 6.6307 2.7726 4.1878 2.9942 4.0817 1.7263 1.9213 1.1116 3.6941 3.1806 3.3155 3.5481 4.7750 3.6597 4.2612 3.3719 3.1599 5.3363 5.2579 5.8615 7.2000 1.2113 1.2091 1.3881 1.9462 4.6117 3.3566 1.7958 1.7643 1.9332 1.4696 2.1633 2.2539 3.4612 2.6279 1.6730 2.1306 2.5596 2.2467 2.2647 2.4630 2.8962 2.6880 3.5675 2.9072 1.3704 1.5478 1.2846 1.3665 1.1179 1.1025 1.2757 1.2889 1.4311 1.5202 1.3423 1.3950 1.2430 1.2187 1.2137 5.1429 1.1606 1.0603 1.0832 1.0507 1.0741 1.0552 1.0616 1.0424 1.0430 1.0771 1.0793 9.8353 1.0593 1.0363 1.0362 1.0612 1.0597 1.0621 1.0372 1.0698 1.0856 1.0974 1.0973 1.1006 1.0907 1.1009 1.1010 1.1000 1.0995 1.1048 1.0969 1.1009
irintensity: 1.6061 0.9889 0.4365 0.5112 0.3789 0.1477 2.1697 0.8990 0.0331 0.1727 0.2592 1.9494 1.9945 6.3308 1.5554 1.7666 0.1260 1.5252 0.9574 5.0897 3.4866 0.5366 1.2972 16.1524 12.4911 3.4618 12.1636 7.7567 12.3307 4.2666 9.9035 16.5575 5.6071 5.1277 5.4280 98.9997 29.5904 15.2256 87.9256 28.3477 108.6930 24.0139 9.8396 19.7708 9.3032 25.5853 1.7907 44.2488 21.7062 58.9783 86.2861 152.5627 222.7007 49.8811 6.9931 6.6636 4.8228 6.2860 3.5832 5.1713 5.2097 6.8544 5.4706 1.5287 5.9757 6.9836 55.7296 13.2445 8.6161 193.1815 14.0287 22.8584 3.9969 16.3908 1.1171 4.7872 3.8736 13.4204 13.6726 11.7689 16.1198 157.1941 34.0326 38.3687 28.7217 2.1109 42.7972 11.9542 1.8435 25.2812 27.0486 1.7737 8.7003 0.1051 4.9252 36.5908 71.4218 39.0478 44.3071 60.9034 7.8944 8.1247
temp: 298.150 k
press: 1.00000 atm
elementType: 8 8 8 8 7 7 6 6 6 6 6 6 6 6 6 6 1 1 1 1 1 1 1 1 1 1 1 1 1 1 1 1 1 1 1 1
symmnumber: 1
zpe: 786238.1 jmol-1
zpe.correction: 0.299462 hartree
zpe.thermalcorrener: 0.318471 hartree
zpe.thermalcorrenthalpy: 0.319415 hartree
zpe.thermalcorrgfe: 0.248832 hartree
zpe.sumelectzpe: -802.073474 hartree
zpe.sumelectthermal: -802.054465 hartree
zpe.sumelectthermalent: -802.053521 hartree
zpe.sumelectthermalfe: -802.124105 hartree
dipole: 0.7202 4.2644 -5.0354
dipole: 6.6377
quadrupole: -91.3830 -100.2669 -107.5850
quadrupole: -3.0663 0.2193 8.2343
quadrupole: 8.3620 -0.5220 -7.8400 -3.0663 0.2193 8.2343
hfenergy: -802.3729363 hartree
pointgroup: C01 [X(C10H20N2O4)]
dipole: 0.4046685 0.9668543 -2.391899 debye
polarizability: 152.9488146|-0.8665333|134.5580971|0.1945223|-8.8939343|133.9198846 unknown
InChI: InChI=1S/C10H20N2O4/c1-4-6-8-11(12(14)15)10(7-5-2)16-9(3)13/h10H,4-8H2,1-3H3
charge 0 multiplicity 1
36 atoms
O  0.909493 0.987273 -0.379713
O  -1.710669 -2.163007 1.620978
O  0.424746 -1.785967 2.383743
O  0.662069 1.793876 1.803939
N  -0.214514 -1.029661 0.286665
N  -0.515961 -1.683708 1.503712
C  1.104433 -0.397869 0.14564
C  2.026684 -1.117861 -0.848121
C  -1.264444 -0.97456 -0.751785
C  -2.368602 0.075332 -0.489013
C  3.443261 -0.503022 -0.897106
C  -3.462443 0.026748 -1.580525
C  4.373705 -1.265454 -1.863901
C  -4.566336 1.081301 -1.352632
C  0.688512 2.008319 0.576987
C  0.503312 3.335268 -0.122394
H  1.543677 -0.351327 1.157819
H  2.088298 -2.176789 -0.530061
H  1.574722 -1.103415 -1.859169
H  -1.719373 -1.97821 -0.837994
H  -0.742256 -0.745022 -1.698014
H  -1.916226 1.085104 -0.459818
H  -2.82351 -0.11467 0.500012
H  3.368587 0.556985 -1.204325
H  3.880265 -0.510844 0.121683
H  -3.916772 -0.984591 -1.596668
H  -3.002107 0.181364 -2.578411
H  4.485063 -2.323198 -1.560313
H  5.381675 -0.813574 -1.886459
H  3.974774 -1.251488 -2.895687
H  -5.343605 1.025535 -2.136261
H  -5.05959 0.931028 -0.374512
H  -4.14796 2.105391 -1.363484
H  -0.390971 3.300667 -0.769548
H  1.368864 3.549587 -0.772341
H  0.3874 4.134361 0.623475
