program: Gaussian 09
title: 000122958
version: EM64L-G09RevD.01
frameworkgroup: C1[X(C3H2Cl3F3O)]
method: RPBEPBE
basis: SDD
operation: Freq
keyword: #p
keyword: freq=noraman
keyword: PBEPBE/SDD
title: #p freq=noraman PBEPBE/SDD
converged: YES YES NO NO
title: Mulliken charges:
elementType: Cl Cl Cl F F F O C C C H H
charge: 0.119879 0.130576 0.012902 -0.140925 -0.163104 -0.084662 -0.193193 0.528560 -0.350765 -0.450733 0.294907 0.296558
chargesum: 0.00000
title: Mulliken charges with hydrogens summed into heavy atoms:
elementType: Cl Cl Cl F F F O C C C
charge: 0.119879 0.130576 0.012902 -0.140925 -0.163104 -0.084662 -0.193193 0.528560 -0.350765 0.140732
polarizability: 6.91650875e+01 1.12306888e+01 7.03538369e+01 3.81682305e+00 4.50380883e+00 5.27276602e+01
1716.lowfreq: -7.1880 -0.0014 0.0016 0.0017 3.9530 7.2550 21.9148 49.5208 89.7500
frequency: 21.7264 49.4255 89.7333 130.2444 164.1350 221.6989 232.2185 273.8176 287.2125 323.7436 356.6737 387.3251 458.2321 495.2182 523.0826 657.0049 665.5562 790.6427 826.5417 927.4185 958.4187 968.2281 1004.6536 1065.8296 1200.2642 1230.5375 1322.4503 1441.1975 3085.2374 3195.3457
redmass: 10.5727 15.6672 18.0120 6.4552 22.2190 11.3831 8.1542 11.9043 12.4446 18.6735 20.6704 13.9074 13.1780 14.6716 15.1644 8.0393 6.9818 12.7807 12.6463 7.1708 3.3572 2.4485 9.7551 7.3382 5.3270 1.2593 1.1626 1.0810 1.0548 1.1161
irintensity: 2.0592 0.7265 0.3400 1.3714 1.2994 2.5136 1.6106 6.3965 3.2047 4.1412 0.7210 12.5230 2.8174 1.5233 10.7171 120.4758 18.5718 232.7136 93.0101 120.2995 87.5277 79.7605 73.4955 462.5193 157.2300 10.2131 15.0151 11.4668 10.5905 0.9367
temp: 298.150 k
press: 1.00000 atm
elementType: 17 17 17 9 9 9 8 6 6 6 1 1
symmnumber: 1
zpe: 139686.8 jmol-1
zpe.correction: 0.053204 hartree
zpe.thermalcorrener: 0.064166 hartree
zpe.thermalcorrenthalpy: 0.065110 hartree
zpe.thermalcorrgfe: 0.013853 hartree
zpe.sumelectzpe: -1869.625503 hartree
zpe.sumelectthermal: -1869.614541 hartree
zpe.sumelectthermalent: -1869.613597 hartree
zpe.sumelectthermalfe: -1869.664854 hartree
dipole: 1.0146 -1.6325 -1.8537
dipole: 2.6703
quadrupole: -77.9566 -74.4844 -78.1277
quadrupole: -5.3505 -0.8764 2.0993
quadrupole: -1.1004 2.3719 -1.2715 -5.3505 -0.8764 2.0993
hfenergy: -1869.678707 hartree
pointgroup: C01 [X(C3H2Cl3F3O1)]
dipole: -0.6578079 -0.073119 -0.8158824 debye
dipolederiv: -0.1323631 0.0256365 0.1192087 0.0356162 -0.1198977 -0.0794753 0.054623 -0.0283875 -0.6811062 -0.1154904 0.0230039 0.011559 -0.0213177 -0.4627372 0.2970024 0.048961 0.2569839 -0.3196511 -0.4082153 -0.0087239 0.1564519 -0.0454253 -0.1411942 0.0615565 0.3629283 0.0337046 -0.3953905 -0.3953082 0.0725812 0.1162611 -0.0624036 -0.3511753 -0.1731754 -0.144492 -0.14787 -0.6985587 -0.4299856 0.0679782 0.0138096 -0.192613 -0.7353556 0.2397856 0.0535545 0.1940848 -0.3836449 -0.5713493 -0.3269411 -0.1514801 -0.187844 -0.5578881 -0.1313128 -0.1128105 -0.1461923 -0.3758859 -1.7942132 -0.1059703 0.1688554 -0.0724903 -0.4400536 -0.0464795 -0.2352977 -0.0016346 -0.4382824 1.6501106 -0.0760766 -0.1488714 0.6375494 1.2548747 -0.0343696 0.3635006 0.0306031 1.0975228 0.7477851 0.3863689 0.0510353 0.1206473 1.177287 -0.1153401 -0.0368081 -0.1084322 1.4904863 1.4331267 0.0071483 -0.4258497 -0.2189087 0.309022 -0.0232914 -0.4358063 -0.1025916 0.7358555 0.0157229 -0.0479219 0.0567462 0.0452276 -0.0204682 0.0364315 0.0704873 0.0427276 0.0188622 0.0001799 -0.0170834 0.032274 -0.0380379 0.0875863 -0.031332 0.01116 -0.0229958 -0.0502071 unknown
polarizability: 63.7354961|0.3944573|54.7030866|-11.1180326|-6.551514|73.8080018 unknown
InChI: InChI=1S/C3H2Cl3F3O/c4-1-10-3(8,9)2(5,6)7/h1H2
charge 0 multiplicity 1
12 atoms
Cl 1.7186 -0.639692 -1.781194
Cl 1.388764 -1.830225 0.995553
Cl -3.245789 -0.055437 1.289968
F  -0.11681 0.85816 1.533957
F  0.125569 1.735559 -0.537554
F  2.434617 0.553575 0.478961
O  -0.995375 -0.30004 -0.307958
C  0.048671 0.48475 0.168134
C  1.40044 -0.279565 0.000999
C  -2.336627 0.270887 -0.310504
H  -2.314499 1.359751 -0.456845
H  -2.875162 -0.269623 -1.096017
