program: Gaussian 09
title: 000122953
version: EM64L-G09RevD.01
frameworkgroup: C1[X(C4H8N2)]
method: RPBEPBE
basis: SDD
operation: Freq
keyword: #p
keyword: freq=noraman
keyword: PBEPBE/SDD
title: #p freq=noraman PBEPBE/SDD
converged: YES YES NO YES
title: Mulliken charges:
elementType: N N C C C C H H H H H H H H
charge: -0.575317 -0.021382 -0.346046 -0.365520 -0.418857 -0.146472 0.243322 0.209700 0.178520 0.207522 0.244727 0.241693 0.281925 0.266186
chargesum: 0.00000
title: Mulliken charges with hydrogens summed into heavy atoms:
elementType: N N C C C C
charge: -0.027206 -0.021382 0.106976 0.020522 0.067563 -0.146472
polarizability: 7.32787004e+01 -4.94444151e+00 4.71645540e+01 9.36047815e-01 -8.25260196e-01 3.99837538e+01
1716.lowfreq: -11.7909 -3.2121 0.0006 0.0011 0.0011 24.4048 78.7089 116.7741 124.6970
frequency: 78.6426 116.7242 124.6738 222.0819 282.1042 371.5656 400.8393 528.5991 573.0800 750.2856 844.6315 924.7596 963.3693 1036.5945 1068.5226 1112.4381 1131.1398 1220.8278 1264.5264 1284.5198 1292.8258 1336.6950 1388.4709 1451.3040 1471.4155 1489.6465 1642.2445 2198.1976 2858.1323 2984.5150 2998.9033 3014.7408 3036.1019 3080.4896 3473.4137 3602.1018
redmass: 2.4366 2.4507 4.4734 1.1283 3.6265 3.5875 4.3177 3.6290 1.4011 1.1100 1.2583 5.3125 1.8204 3.1380 2.1756 2.8074 1.3253 1.3391 1.2015 1.1790 1.1689 1.3905 1.4441 1.0814 1.0772 1.0903 1.0948 12.4301 1.0716 1.0588 1.0687 1.0814 1.0993 1.1026 1.0451 1.0983
irintensity: 1.9955 1.8105 2.0335 58.2394 5.0118 0.8562 15.0149 45.5818 213.0030 8.7256 0.0560 3.0835 0.5638 2.6352 3.0383 19.3069 7.2931 2.0867 0.4736 0.9644 10.6008 3.1127 15.0783 7.4723 7.2912 6.0991 40.3833 16.9703 125.6030 7.0684 10.9572 48.6157 2.5645 41.6359 0.3849 1.4232
temp: 298.150 k
press: 1.00000 atm
elementType: 7 7 6 6 6 6 1 1 1 1 1 1 1 1
symmnumber: 1
zpe: 308750.9 jmol-1
zpe.correction: 0.117597 hartree
zpe.thermalcorrener: 0.125040 hartree
zpe.thermalcorrenthalpy: 0.125984 hartree
zpe.thermalcorrgfe: 0.086084 hartree
zpe.sumelectzpe: -266.219023 hartree
zpe.sumelectthermal: -266.211580 hartree
zpe.sumelectthermalent: -266.210636 hartree
zpe.sumelectthermalfe: -266.250536 hartree
dipole: -4.4988 2.2619 1.0066
dipole: 5.1351
quadrupole: -47.7827 -36.7821 -36.2331
quadrupole: 2.9755 -2.3100 -2.2639
quadrupole: -7.5168 3.4839 4.0329 2.9755 -2.3100 -2.2639
hfenergy: -266.3366199 hartree
pointgroup: C01 [X(C4H8N2)]
dipole: 1.7726345 -0.8876744 0.3890739 debye
dipolederiv: -0.636707 -0.1329637 -0.0460938 -0.1934527 -0.5679915 0.2738918 -0.0083146 0.2599769 -0.4900523 -0.3717396 -0.0056882 -0.0021888 0.0893045 -0.2349795 0.00188 -0.003091 -0.0008291 -0.2409329 0.0236234 0.0443301 -0.0232357 0.2037931 0.0332676 0.0219688 -0.0131476 0.0468336 0.1518416 0.5232922 0.2213612 -0.0317989 0.1136391 0.3906177 -0.1329581 0.0410449 -0.0872806 0.3524236 -0.1147746 0.037916 -0.0077079 0.029314 0.1440425 -0.0037862 -0.0087126 -0.0022348 0.2538835 0.2117646 -0.1122559 0.0011138 -0.2205502 -0.0204331 -0.004303 0.0079956 -0.0024664 -0.0630741 0.0561031 -0.0025336 -0.0148476 0.0026475 0.0023181 0.0959548 -0.0216733 0.0999541 -0.0481953 0.0409692 -0.0075167 0.0197237 -0.0018078 -0.019647 -0.1053912 0.0043895 -0.1281318 -0.0670636 -0.0614931 -0.0778366 0.0296456 -0.0612607 -0.1590999 0.1571629 0.0428339 0.2141982 -0.1410001 0.0396487 -0.005282 0.018512 -0.0091924 -0.041774 -0.1034612 0.029398 -0.135821 -0.0883816 0.0505857 0.0267058 0.0069556 0.0063419 0.0260542 -0.0796823 -0.0046915 -0.1114287 -0.0074295 0.0644468 0.0325748 -0.0072617 0.0015479 0.0288847 0.0787416 0.0114322 0.112211 -0.0176467 -0.0023134 0.0271565 0.0181561 0.0926852 0.1772382 -0.095472 -0.0907372 -0.085801 0.3166535 0.1765941 -0.0459676 0.0390276 -0.0530094 0.2415021 -0.1045459 0.0132738 -0.1791804 0.0889738 unknown
polarizability: 73.4505379|-4.5483268|46.9107027|-0.3626618|1.1122627|40.0657676 unknown
InChI: InChI=1S/C4H8N2/c5-3-1-2-4-6/h1-3,5H2
charge 0 multiplicity 1
14 atoms
N  3.014747 0.514065 0.074001
N  -3.004054 0.468451 -0.044526
C  0.554209 0.264707 -0.001864
C  1.914248 -0.462811 0.063578
C  -0.629211 -0.742498 -0.001592
C  -1.944409 -0.080557 -0.025643
H  0.527177 0.891285 -0.910398
H  0.452748 0.946123 0.865311
H  1.907639 -1.15607 0.942744
H  2.028575 -1.095797 -0.837914
H  -0.556461 -1.41209 -0.880971
H  -0.577732 -1.388821 0.896956
H  3.936867 0.135726 -0.15566
H  3.035558 1.125088 0.895477
