program: Gaussian 09
title: 000122940
version: EM64L-G09RevD.01
frameworkgroup: C1[X(C10H16N2)]
method: RPBEPBE
basis: SDD
operation: Freq
keyword: #pfreq=noraman
keyword: PBEPBE/SDD
title: #p freq=noraman PBEPBE/SDD
converged: YES YES NO NO
title: Mulliken charges:
elementType: N N C C C C C C C C C C H H H H H H H H H H H H H H H H
charge: -0.020623 -0.020543 -0.019716 -0.394593 -0.497616 -0.720303 -0.709655 0.132813 0.071057 -0.779389 -0.292969 -0.290037 0.218903 0.196340 0.203783 0.202749 0.233431 0.208735 0.246730 0.197825 0.209380 0.203120 0.215507 0.233876 0.232440 0.258316 0.239338 0.241101
chargesum: 0.00000
title: Mulliken charges with hydrogens summed into heavy atoms:
elementType: N N C C C C C C C C C C
charge: -0.020623 -0.020543 0.199187 0.005530 -0.061436 -0.067012 -0.081649 0.132813 0.071057 -0.054758 -0.053631 -0.048935
polarizability: 1.32882794e+02 -6.56253218e+00 1.28812004e+02 1.37403798e+01 -2.97949560e+00 9.06371404e+01
1716.lowfreq: -23.6866 -6.5497 -0.0008 -0.0006 -0.0006 7.4686 20.8929 43.3264 59.2899
frequency: 12.2241 42.6813 59.1924 113.0713 133.8464 162.1832 203.9853 216.9709 232.1208 297.7509 330.8932 364.8308 400.1714 422.4380 440.2317 465.7339 514.4027 569.7772 594.5824 691.1808 751.5742 786.2870 844.6866 855.9349 891.0635 900.2038 916.2128 952.1045 952.5099 960.6987 967.4731 1015.3961 1043.1896 1054.4683 1077.1851 1118.1507 1145.5036 1176.6086 1202.0397 1227.6271 1245.4419 1255.2120 1261.5761 1294.7539 1324.0066 1335.4990 1347.9590 1372.7452 1389.1862 1392.0395 1399.9209 1416.0354 1451.1520 1456.7218 1466.2287 1468.9576 1470.4577 1474.7244 1479.9936 1495.3806 1512.9858 1522.2364 2959.4316 2964.4978 2968.2962 2978.1987 2983.3092 3004.6448 3019.8010 3055.9562 3061.6256 3062.1571 3069.4684 3074.9124 3080.2501 3116.1046 3129.8303 3156.7191
redmass: 2.5870 3.5947 3.9000 3.0701 1.1040 2.0803 1.1546 1.7647 1.5657 2.9053 2.3620 2.2057 2.1397 2.1043 3.6733 3.6136 3.9739 5.5701 3.4903 4.0822 2.5075 3.5386 1.9295 1.5961 1.8133 2.3158 1.2570 1.4839 1.4889 1.8422 1.7394 2.3607 1.5632 2.3423 1.8966 1.8148 2.4075 1.8478 1.7132 1.6374 2.2458 2.5082 1.9178 1.2816 1.5001 1.4054 1.4855 1.2078 1.2603 1.2312 2.7518 1.8157 1.0911 1.2332 1.0590 1.0760 1.0532 1.0604 1.0605 1.0530 5.9051 4.3973 1.0578 1.0359 1.0404 1.0799 1.0388 1.0662 1.0977 1.0988 1.0959 1.0987 1.0989 1.0992 1.0987 1.0986 1.0875 1.0993
irintensity: 0.0483 0.0748 0.0904 0.0788 0.7880 0.0088 0.2507 0.7090 3.1204 4.9141 2.1543 1.3015 1.9294 1.8643 5.6282 1.7634 1.5988 0.4396 0.0589 1.8159 2.5474 0.3578 3.0152 18.4693 7.5469 6.0972 4.5262 0.4138 0.5655 5.1440 8.6431 6.7137 7.0577 5.6217 13.1454 6.5886 10.3534 4.6026 3.8466 10.7905 1.5338 0.2247 1.0108 0.3004 1.8564 1.7116 6.9717 20.0520 29.5969 17.4524 59.9434 18.4010 3.9560 17.4207 2.9344 6.7421 14.5642 18.3270 9.6913 14.6221 10.2345 3.3158 25.8780 45.2309 31.8580 18.3293 15.4747 24.5586 46.0020 15.3037 14.4095 59.3120 60.5270 41.8904 24.2119 9.8632 1.3957 49.7589
temp: 298.150 k
press: 1.00000 atm
elementType: 7 7 6 6 6 6 6 6 6 6 6 6 1 1 1 1 1 1 1 1 1 1 1 1 1 1 1 1
symmnumber: 1
zpe: 631781.4 jmol-1
zpe.correction: 0.240633 hartree
zpe.thermalcorrener: 0.253625 hartree
zpe.thermalcorrenthalpy: 0.254569 hartree
zpe.thermalcorrgfe: 0.199569 hartree
zpe.sumelectzpe: -499.229942 hartree
zpe.sumelectthermal: -499.216950 hartree
zpe.sumelectthermalent: -499.216006 hartree
zpe.sumelectthermalfe: -499.271006 hartree
dipole: -0.5727 0.7138 -0.1821
dipole: 0.9331
quadrupole: -77.3652 -69.3725 -75.3279
quadrupole: -4.3716 -0.7304 -4.0157
quadrupole: -3.3433 4.6494 -1.3060 -4.3716 -0.7304 -4.0157
hfenergy: -499.4705753 hartree
pointgroup: C01 [X(C10H16N2)]
dipole: 0.2295857 -0.2808067 -0.0566605 debye
polarizability: 132.9798429|-7.2680888|128.7919938|-13.5723213|0.6044404|90.5601016 unknown
InChI: InChI=1S/C10H16N2/c1-8(2)4-5-10-9(3)11-6-7-12-10/h6-8H,4-5H2,1-3H3
charge 0 multiplicity 1
28 atoms
N  -0.655304 1.255213 -0.669122
N  -2.652251 -0.231753 0.702558
C  2.431603 0.216596 0.38205
C  1.792988 -1.042204 -0.264799
C  0.612326 -0.769484 -1.248368
C  3.017866 1.18269 -0.674364
C  3.517884 -0.216075 1.396351
C  -0.583482 -0.112764 -0.590736
C  -1.598228 -0.862948 0.094581
C  -1.582212 -2.373793 0.170534
C  -1.712081 1.868972 -0.059442
C  -2.700715 1.131352 0.625959
H  1.639491 0.762029 0.934597
H  1.44887 -1.721403 0.542164
H  2.579911 -1.591188 -0.822425
H  0.309351 -1.730086 -1.706081
H  0.958837 -0.106502 -2.059684
H  3.528125 2.032515 -0.183666
H  2.225838 1.598128 -1.321362
H  3.762168 0.665226 -1.311505
H  3.101059 -0.879685 2.177908
H  4.33447 -0.764573 0.887002
H  3.965032 0.661372 1.899122
H  -1.686012 -2.827716 -0.833663
H  -0.639798 -2.755838 0.602553
H  -2.424531 -2.709193 0.794951
H  -1.75703 2.960842 -0.131417
H  -3.547075 1.62197 1.118203
