program: Gaussian 09
title: 000122931
version: EM64L-G09RevD.01
frameworkgroup: C1[X(C12H12N2)]
method: RPBEPBE
basis: SDD
operation: Freq
keyword: #pfreq=noraman
keyword: PBEPBE/SDD
title: #p freq=noraman PBEPBE/SDD
converged: YES YES NO NO
title: Mulliken charges:
elementType: N N C C C C C C C C C C C C H H H H H H H H H H H H
charge: -0.000100 -0.000574 0.117458 0.541993 -0.691139 -0.691146 -0.742761 -0.571179 -0.390088 0.277330 -0.415862 0.281027 -0.256960 -0.242745 0.218464 0.215474 0.227430 0.215458 0.218463 0.227435 0.228011 0.220850 0.220866 0.282990 0.246018 0.263286
chargesum: 0.00000
title: Mulliken charges with hydrogens summed into heavy atoms:
elementType: N N C C C C C C C C C C C C
charge: -0.000100 -0.000574 0.117458 0.541993 -0.029770 -0.029791 -0.073034 -0.288189 -0.144070 0.277330 -0.152576 0.281027 -0.256960 -0.242745
polarizability: 2.04853102e+02 5.14593374e+00 1.43630937e+02 2.94914796e-04 -8.84635783e-04 7.91922746e+01
1716.lowfreq: -5.8326 -0.0003 0.0006 0.0008 6.9693 10.7730 38.8296 68.2768 108.7389
frequency: 38.3507 68.2164 108.7387 131.2218 139.1889 177.9468 218.0818 237.5533 258.9980 281.9829 309.9992 318.5357 324.1749 371.7801 384.5062 408.9318 454.8742 469.6707 475.9988 528.4084 547.2826 611.9444 651.9280 657.9053 716.8489 770.3862 802.8094 858.3942 901.1918 920.0363 933.7671 936.0986 945.3259 986.1354 1022.3555 1025.2630 1086.6358 1126.9404 1196.0046 1204.0561 1214.7434 1221.8591 1270.3842 1293.6538 1362.6991 1379.4330 1379.7792 1394.2544 1410.3154 1462.8583 1465.6885 1466.4627 1481.3329 1490.0694 1491.2098 1499.0931 1553.5295 1604.2186 2181.3606 2183.5418 2976.5375 2978.6592 2983.1886 3071.8555 3075.7583 3076.3044 3080.8782 3083.9048 3084.6122 3142.8949 3168.6772 3179.6749
redmass: 3.3927 5.3723 12.6686 6.2275 4.6825 3.4702 1.1489 3.0910 1.2135 3.0649 1.1294 2.7372 2.7491 3.1025 3.5845 5.0077 3.3426 6.8285 4.5096 4.0378 5.0361 5.9821 6.0261 4.0005 7.0133 3.6609 3.4199 1.4770 3.5156 1.7961 1.6615 1.4633 1.2040 1.3824 1.3964 1.3845 2.7635 2.3571 1.9323 2.9427 2.3580 2.6166 2.1829 1.7589 8.1426 1.1804 1.4086 2.5907 1.2127 1.0501 1.0476 1.1121 1.1888 1.0491 1.7512 1.1178 7.0685 6.0933 12.6299 12.6352 1.0356 1.0346 1.0358 1.1007 1.0997 1.1003 1.0999 1.0995 1.0986 1.0883 1.0964 1.0916
irintensity: 0.3351 1.2350 1.0942 2.7836 0.2666 2.9401 0.0802 0.6034 0.0180 0.4012 0.0717 0.1126 0.1746 0.4887 0.0012 0.1039 0.0497 0.4199 1.5860 0.0213 6.5295 0.3010 0.5330 8.5918 2.1587 0.7811 4.0232 34.9879 12.0973 0.7709 2.3629 12.5240 0.9625 1.2092 2.7554 0.3994 2.4747 14.0930 13.8731 5.0174 2.0287 9.7404 16.6693 6.6647 3.5459 18.6183 15.0461 15.1645 8.7894 0.1361 0.6279 1.7931 24.0193 13.8672 6.7442 35.7153 1.0056 35.1202 20.0532 9.0524 26.0748 29.1913 21.1472 13.0878 3.1436 3.9573 30.8881 60.9517 88.5926 8.2221 5.9143 0.5310
temp: 298.150 k
press: 1.00000 atm
elementType: 7 7 6 6 6 6 6 6 6 6 6 6 6 6 1 1 1 1 1 1 1 1 1 1 1 1
symmnumber: 1
zpe: 540221.0 jmol-1
zpe.correction: 0.205759 hartree
zpe.thermalcorrener: 0.219485 hartree
zpe.thermalcorrenthalpy: 0.220429 hartree
zpe.thermalcorrgfe: 0.165703 hartree
zpe.sumelectzpe: -572.957755 hartree
zpe.sumelectthermal: -572.944030 hartree
zpe.sumelectthermalent: -572.943086 hartree
zpe.sumelectthermalfe: -572.997812 hartree
dipole: -8.1023 -2.1800 0.0000
dipole: 8.3905
quadrupole: -106.5645 -85.7292 -83.7356
quadrupole: -4.5340 -0.0002 0.0015
quadrupole: -14.5547 6.2806 8.2742 -4.5340 -0.0002 0.0015
hfenergy: -573.1635143 hartree
pointgroup: C01 [X(C12H12N2)]
dipole: -3.1974698 -0.8204796 -0.0004197 debye
dipolederiv: -0.2245051 -0.0462089 -0.0000616 -0.0653519 -0.2772524 -0.0000908 -0.0000063 -0.0000311 -0.2271975 -0.3430149 0.0670442 0.0000118 0.0603797 -0.2209707 -0.000002 -0.0000306 0.0000093 -0.2290088 0.1183381 -0.030707 0.0000347 -0.1845036 0.1381004 -0.0000545 0.0002033 -0.00003 0.1125953 0.5685954 -0.0528075 0.0001201 0.0287765 -0.1087215 0.0000253 0.0000765 0.000003 -0.0768216 -0.076797 -0.0061759 0.0330694 0.0649253 0.008923 0.0345658 -0.067084 0.0418799 -0.0063855 -0.0767772 -0.0062021 -0.0330882 0.064997 0.0088349 -0.0345646 0.0669288 -0.0418979 -0.006291 -0.0406372 0.0304922 -0.0000317 0.0196413 -0.0629018 0.0000631 -0.0000317 0.0000622 0.0404407 -0.3577157 0.0398825 -0.0000633 -0.1907527 0.0265824 -0.000089 -0.0000035 -0.0000551 -0.1202002 -0.1064568 0.1409903 -0.0000392 0.1906277 -0.0316737 0.0000184 -0.0000755 0.0000097 -0.1179111 0.1710892 -0.0801924 0.0000465 -0.1309425 0.1380089 -0.0000301 0.0000736 -0.00003 0.1232781 -0.0387497 -0.1030866 0.0000483 0.0105101 0.0749035 -0.0000596 0.0000312 -0.0000939 -0.1308267 -0.0920435 0.010334 -0.0000507 0.0729592 0.1392573 0.0000007 -0.0000891 -0.0000379 0.0980122 0.0667492 0.1630539 0.0000139 0.1325937 0.1315379 0.0000723 0.0000273 0.0000869 0.0323913 0.3162334 -0.1230387 0.0000604 -0.0679492 -0.0142512 0.0000107 0.0000424 -0.0000006 0.0352817 -0.2182265 0.0266733 0.0315542 0.0460696 0.0931045 0.0088766 0.020942 0.0104243 0.0752556 0.1178481 0.0597299 0.0028335 0.0390307 -0.1545172 0.0373131 -0.0087046 -0.0144153 0.0672816 0.0823885 -0.0466225 -0.0896117 -0.0373738 0.0431089 -0.0939761 -0.0563414 -0.0510904 -0.0932594 0.1178686 0.0597212 -0.0028722 0.0390453 -0.1545572 -0.0370404 0.0086752 0.0146808 0.0673058 -0.2181978 0.0266459 -0.0316912 0.0460756 0.093081 -0.0088721 -0.0210698 -0.0104298 0.0752621 0.0823355 -0.0465325 0.0897299 -0.0373485 0.0432754 0.0937956 0.0564431 0.0509259 -0.0933769 -0.1974823 0.0682779 -0.0000868 0.0030328 0.0878856 0.0000085 -0.0000547 0.0000192 0.0996801 0.0787953 -0.066989 -0.0878571 -0.0399957 0.0117377 -0.070803 -0.0821471 -0.092782 -0.0739773 0.0787351 -0.0669068 0.0879728 -0.039915 0.011924 0.0706928 0.0822342 0.0926659 -0.0741047 0.1287784 0.0287866 -0.0000097 0.0457422 -0.0170357 0.0000594 -0.0000229 0.0000448 0.1319514 0.0004518 -0.0966546 0.0000051 -0.1101973 0.0204054 0.0000073 0.0000117 0.0000062 0.1317485 0.0623968 0.0504925 -0.0000372 0.0399238 -0.0287893 0.0000729 -0.0000281 0.000076 0.1588762 unknown
polarizability: 204.9647324|4.4309795|143.5192901|0.0278298|-0.0241505|79.1922906 unknown
InChI: InChI=1S/C12H12N2/c1-12(2,3)11-5-4-9(7-13)10(6-11)8-14/h4-6H,1-3H3
charge 0 multiplicity 1
26 atoms
N  2.80386 2.630168 -0.000501
N  4.136136 -1.341039 0.001642
C  -2.763124 0.126863 -0.000655
C  -1.243422 -0.149504 -0.000224
C  -3.396717 -0.513374 1.272686
C  -3.396281 -0.514795 -1.273499
C  -3.089506 1.6420 -0.00156
C  -0.279762 0.885782 -0.000334
C  -0.766318 -1.491211 0.000327
C  1.112907 0.60931 0.000091
C  0.607371 -1.78769 0.000747
C  1.570837 -0.744872 0.000636
C  2.048352 1.703584 -0.000022
C  2.973451 -1.061994 0.001078
H  -4.488073 -0.337695 1.276955
H  -3.231525 -1.604837 1.312612
H  -2.972334 -0.071011 2.192209
H  -3.231118 -1.606309 -1.312128
H  -4.487629 -0.339083 -1.278345
H  -2.971561 -0.073494 -2.193377
H  -4.185409 1.780399 -0.001819
H  -2.691784 2.151426 0.895647
H  -2.691498 2.150415 -0.899214
H  -0.592818 1.932455 -0.00074
H  -1.480873 -2.32091 0.000423
H  0.950038 -2.826682 0.001164
