program: Gaussian 09
title: 000122902
version: EM64L-G09RevD.01
frameworkgroup: C1[X(C21H13N3O2)]
method: RPBEPBE
basis: SDD
operation: Freq
keyword: #p
keyword: freq=noraman
keyword: PBEPBE/SDD
title: #p freq=noraman PBEPBE/SDD
converged: YES YES NO NO
title: Mulliken charges:
elementType: O O N N N C C C C C C C C C C C C C C C C C C C C C H H H H H H H H H H H H H
charge: -0.311537 -0.302163 -0.494035 -0.648591 -0.009081 0.082093 0.166189 0.292024 0.293303 0.283553 -0.130614 -0.168872 0.085281 -0.621707 0.359365 -0.385928 -0.384356 0.429198 -0.228627 -0.229064 -0.425948 -0.383225 -0.304023 -0.195513 -0.217497 -0.248895 0.304055 0.380019 0.293121 0.293960 0.238692 0.238871 0.338885 0.394852 0.250962 0.267925 0.231231 0.231762 0.234338
chargesum: 0.00000
title: Mulliken charges with hydrogens summed into heavy atoms:
elementType: O O N N N C C C C C C C C C C C C C C C C C C C C C
charge: -0.311537 -0.302163 -0.114016 0.085146 -0.009081 0.082093 0.166189 0.292024 0.293303 0.283553 -0.130614 -0.168872 0.085281 -0.317652 0.359365 -0.092808 -0.090395 0.429198 0.010065 0.009806 -0.174986 -0.115300 -0.304023 0.035719 0.014265 -0.014557
polarizability: 5.23382206e+02 3.06946297e+01 3.46895635e+02 -3.40413540e+00 1.34357152e+01 1.12696815e+02
1716.lowfreq: -0.0006 -0.0004 -0.0001 2.0927 6.6513 7.7379 33.8779 39.0903 44.0597
frequency: 33.8165 39.0880 44.0592 71.0592 89.1075 105.6534 112.8944 148.7050 156.0025 168.5108 205.5795 234.4506 238.0945 264.1220 308.0652 327.0945 358.3711 366.9109 389.6161 407.3039 410.4662 419.1192 425.5831 445.0722 464.3801 483.1177 502.1044 513.2396 527.9510 552.8426 566.1100 573.1081 606.0916 616.2245 629.7235 657.4622 689.7577 693.7135 702.4989 720.2113 729.6791 760.5139 762.8114 800.6080 807.2162 822.2118 843.0847 859.4059 860.0149 880.3766 897.7840 912.4888 933.2583 935.6875 942.9607 975.7814 985.8345 992.5212 997.1458 997.5765 1014.2013 1025.9303 1030.8699 1087.3026 1088.1855 1117.8545 1143.0191 1170.9475 1173.5174 1184.9808 1188.6968 1244.6599 1249.7190 1270.4633 1298.4181 1317.9169 1331.2731 1350.9288 1370.5327 1379.5454 1386.1891 1407.2815 1417.3112 1437.0076 1450.8289 1457.0473 1472.1841 1486.1621 1520.5894 1527.8551 1563.4416 1575.9846 1590.2768 1603.3543 1608.0293 1611.7765 1629.3962 2164.5318 3002.8070 3130.2014 3135.0924 3135.8920 3148.3220 3153.0257 3155.6217 3166.8353 3170.8182 3174.1265 3176.9823 3216.4614 3587.3974
redmass: 5.7535 5.3260 6.3171 5.2899 5.7769 6.8347 10.0484 6.0104 6.4304 5.7645 7.3407 5.9217 5.2104 5.6709 7.2275 6.3151 5.8020 6.4760 7.5187 7.3014 3.3130 6.0375 3.5800 6.2468 10.4304 4.9962 3.6013 8.1047 2.6780 7.2546 1.4560 7.5965 6.0972 6.6333 6.0787 6.2818 4.9029 3.2026 3.3573 4.4392 2.7521 4.5866 1.8098 5.6316 1.9331 3.2872 1.3302 1.4393 1.7863 3.5756 1.4704 1.5164 1.8864 1.4495 4.3242 1.4085 5.1527 1.3141 4.9719 1.4014 1.3625 2.1293 2.1202 2.0092 1.8357 3.6244 1.8661 1.1022 1.0516 2.0401 1.1974 3.0252 1.7044 2.4231 1.7603 2.3740 2.0759 3.9313 4.1772 8.4110 7.0190 7.9542 3.7592 3.3155 2.9761 3.6633 2.7932 2.6701 7.5505 5.7488 2.1390 3.1970 3.3399 3.2696 6.0517 3.7148 6.1321 12.6242 1.0836 1.0850 1.0881 1.0865 1.0924 1.0909 1.0965 1.0944 1.1013 1.0994 1.0926 1.0641 1.0890
irintensity: 0.6962 0.1851 0.2356 0.3831 1.3161 6.9203 3.5096 0.5772 1.3984 0.2087 0.1979 0.6276 2.3721 3.0552 2.3822 2.9636 2.6245 0.5246 3.2106 9.3280 0.4617 1.4222 0.5017 23.0257 5.4580 6.7284 11.2312 0.3668 10.0275 3.1792 126.7320 9.7844 4.7948 0.6054 6.0554 12.2490 1.4762 13.8194 23.2703 4.5863 32.2827 8.7045 45.6243 3.8862 48.0428 12.7916 5.9712 79.6475 50.4413 28.7557 21.7448 85.5918 0.3905 9.3164 28.4803 1.7612 1.7756 1.3946 24.7757 5.9903 0.0327 10.3031 11.0230 10.2330 5.6546 24.4388 17.5942 15.8721 0.1610 5.3113 0.3576 19.3904 21.3633 24.1473 82.3135 420.6668 305.9429 137.2927 39.3603 1.4814 7.5190 19.3473 67.0041 20.0630 6.2687 4.9130 5.7632 108.0970 305.9413 343.8890 80.7948 99.8777 72.6096 150.3788 6.1826 4.1077 82.6694 49.8912 32.0959 9.3851 1.3859 4.0067 14.2430 15.5501 25.5308 1.2736 28.6454 33.0234 0.1693 40.0930 83.6652
temp: 298.150 k
press: 1.00000 atm
elementType: 8 8 7 7 7 6 6 6 6 6 6 6 6 6 6 6 6 6 6 6 6 6 6 6 6 6 1 1 1 1 1 1 1 1 1 1 1 1 1
symmnumber: 1
zpe: 755238.6 jmol-1
zpe.correction: 0.287655 hartree
zpe.thermalcorrener: 0.307576 hartree
zpe.thermalcorrenthalpy: 0.308520 hartree
zpe.thermalcorrgfe: 0.238822 hartree
zpe.sumelectzpe: -1121.041690 hartree
zpe.sumelectthermal: -1121.021769 hartree
zpe.sumelectthermalent: -1121.020825 hartree
zpe.sumelectthermalfe: -1121.090524 hartree
dipole: 0.2852 -2.5881 0.3274
dipole: 2.6243
quadrupole: -126.6331 -157.4911 -151.4001
quadrupole: -2.8076 0.9917 5.1358
quadrupole: 18.5417 -12.3164 -6.2253 -2.8076 0.9917 5.1358
hfenergy: -1121.3293454 hartree
pointgroup: C01 [X(C21H13N3O2)]
dipole: 0.0917612 1.0241142 -0.0935116 debye
polarizability: 524.4945823|-27.1670561|344.5358172|-1.9793325|21.9988406|113.9442565 unknown
InChI: InChI=1S/C21H13N3O2/c22-11-12-10-16(24-13-6-2-1-3-7-13)17-18(19(12)23)21(26)15-9-5-4-8-14(15)20(17)25/h1-10,24H,23H2
charge 0 multiplicity 1
39 atoms
O  -0.381914 2.458868 0.284818
O  -3.538501 -2.065242 -0.176047
N  1.756766 1.057961 0.179185
N  -1.455842 -3.581019 -0.14161
N  1.811578 -4.937473 0.105079
C  -0.476598 0.04636 0.075312
C  -1.304722 -1.135045 -0.014446
C  0.963675 -0.076333 0.105779
C  -2.568299 1.491758 0.062418
C  -3.381472 0.327506 -0.049128
C  -1.095106 1.379333 0.144902
C  -2.771254 -1.023709 -0.083441
C  -0.70479 -2.442366 -0.044416
C  1.537457 -1.38718 0.125594
C  0.740829 -2.532714 0.054227
C  -3.176072 2.773879 0.100415
C  -4.791941 0.459394 -0.122499
C  3.162335 1.171362 0.012849
C  -4.575545 2.89562 0.02455
C  -5.386516 1.734356 -0.087248
C  3.838855 2.171262 0.765037
C  3.898207 0.392665 -0.923729
C  1.345604 -3.834777 0.086241
C  5.224333 2.370956 0.599429
C  5.286867 0.592719 -1.07279
C  5.960066 1.57666 -0.312004
H  2.61797 -1.501143 0.23766
H  1.178927 1.927015 0.315193
H  -2.526905 3.649973 0.188889
H  -5.390629 -0.452493 -0.205691
H  -5.041406 3.886485 0.052218
H  -6.47585 1.832495 -0.145236
H  -1.013086 -4.50009 -0.150397
H  -2.483394 -3.439283 -0.190341
H  3.272242 2.776003 1.48197
H  3.383032 -0.32862 -1.566191
H  5.731799 3.142681 1.188552
H  5.839834 -0.010637 -1.801182
H  7.037261 1.729715 -0.434821
