program: Gaussian 09
title: 000014642
version: EM64L-G09RevD.01
frameworkgroup: C1[X(C15H22O3)]
method: RPBEPBE
basis: SDD
operation: Freq
keyword: #pfreq=noraman
keyword: PBEPBE/SDD
title: #p freq=noraman PBEPBE/SDD
converged: YES YES NO NO
title: Mulliken charges:
elementType: O O O C C C C C C C C C C C C C C C H H H H H H H H H H H H H H H H H H H H H H
charge: -0.290707 -0.261108 -0.422480 -0.378355 -0.371062 -0.374982 -0.352611 -0.396017 -0.356393 -0.274085 -0.695904 0.187445 0.222285 -0.322371 -0.312068 -0.342063 -0.375329 0.296136 0.194129 0.193420 0.190271 0.190521 0.194847 0.195305 0.188244 0.187872 0.211355 0.211312 0.195385 0.195275 0.226132 0.228099 0.209785 0.209683 0.215876 0.272548 0.270472 0.257304 0.223692 0.358141
chargesum: 0.00000
title: Mulliken charges with hydrogens summed into heavy atoms:
elementType: O O O C C C C C C C C C C C C C C C
charge: -0.290707 -0.261108 -0.064339 0.009194 0.009730 0.015170 0.023506 0.026650 0.034268 0.180146 -0.060560 0.187445 0.222285 -0.049823 -0.041597 -0.084758 -0.151637 0.296136
polarizability: 2.61388220e+02 -1.63174243e+01 1.74503539e+02 5.32364240e-01 6.45065569e-01 1.04634758e+02
1716.lowfreq: -11.8250 -0.0008 -0.0008 0.0009 3.1636 7.2290 15.7634 19.8251 32.9871
frequency: 15.3950 18.9346 32.6320 41.1416 69.0824 71.6119 76.2063 96.0628 103.2363 133.5713 140.9115 141.2728 165.9405 176.3774 227.9421 235.7427 297.0108 301.9384 329.5049 364.6979 390.5868 393.6200 415.0750 441.5543 472.9497 502.3929 523.2510 600.1091 630.9961 674.2368 720.3635 728.6415 750.0970 752.5623 773.5741 791.3668 817.0659 821.5046 853.1702 857.7922 888.0945 913.2180 936.4498 963.6406 990.3809 993.8856 1001.8528 1010.1331 1023.4540 1045.7525 1059.2822 1078.4501 1079.8658 1087.5372 1104.4712 1126.0443 1144.9195 1152.2606 1174.1563 1188.5324 1220.3797 1224.1514 1243.1863 1256.5566 1258.3293 1265.4911 1275.6352 1283.2756 1293.8086 1295.9291 1303.8375 1306.8680 1338.5081 1355.0652 1357.6579 1375.7573 1390.6651 1400.8731 1430.5917 1460.9377 1461.6926 1466.3108 1468.3267 1474.3589 1478.1770 1480.6251 1486.7066 1489.5342 1498.5681 1586.4548 1616.6200 1623.6845 2950.8497 2952.2463 2955.7274 2962.4547 2968.4932 2971.8638 2984.7240 2986.8505 2992.9754 2998.9352 3005.6118 3021.6564 3035.6421 3044.2827 3068.1682 3070.8517 3072.4534 3119.6725 3155.4231 3176.2203 3179.7255 3577.9902
redmass: 4.0913 3.1983 2.1838 3.4299 3.0074 3.9321 2.3995 3.5442 2.5854 2.1925 2.0970 4.1284 5.0063 3.4746 4.3633 1.1248 4.8784 6.0383 4.2617 5.3808 3.7938 1.1367 2.8276 3.4516 3.3388 2.9022 4.7529 6.9754 7.0730 4.1669 1.0619 1.0813 2.4821 1.3928 7.5380 1.1654 1.3440 7.4564 1.5633 1.2125 2.0071 6.4654 1.1969 1.3592 1.3473 4.5178 3.1131 1.1193 3.5666 3.3328 4.2330 2.5061 2.2939 2.2766 1.4344 2.9796 1.3616 1.4755 1.1126 1.6424 1.2913 1.3749 2.4700 2.9573 1.2803 1.4020 1.1152 1.0532 1.1253 1.0915 1.3314 1.3270 1.4187 1.6199 1.6056 1.5697 1.2174 5.5477 3.5487 1.0735 1.0749 1.0689 1.0809 1.0791 1.0424 1.0808 1.0875 1.0964 2.7797 7.1874 9.8462 6.6453 1.0589 1.0588 1.0592 1.0590 1.0585 1.0367 1.0968 1.0596 1.0991 1.0567 1.1021 1.1039 1.1042 1.1046 1.1007 1.0993 1.1078 1.0905 1.0889 1.0950 1.0963 1.0660
irintensity: 1.1207 0.1874 0.4724 0.0959 0.4838 0.1760 0.2196 0.0031 0.0536 0.3105 0.0356 0.3709 1.5586 3.1323 1.9382 0.0303 1.3992 2.2497 8.7642 13.5493 6.8207 144.4287 4.6926 6.7674 1.2905 17.1808 2.5532 17.4209 3.1197 28.3576 14.6408 0.0555 19.4151 0.2019 20.3557 0.6989 17.3533 9.3832 42.9734 1.9791 1.4821 24.5230 0.8720 0.7697 0.3164 0.3635 33.9469 0.0819 2.3444 29.4664 281.8267 26.9027 4.3766 34.6063 106.8658 0.5320 306.2459 1.4267 59.0755 0.0010 2.7399 0.3867 229.2506 165.0098 12.1876 53.9479 0.4661 0.4666 0.0546 0.1238 12.2843 1.9015 2.7104 0.9575 0.1915 1.7711 11.3819 5.2265 4.9825 0.0286 0.0497 0.4776 0.0169 2.3945 12.3438 0.5829 2.1715 35.6220 51.9856 87.0027 118.1561 208.0243 0.2290 1.0855 0.3913 29.6067 140.0281 35.2732 0.0366 20.9150 0.4025 42.5212 1.0423 0.1613 58.0124 65.7016 86.0568 55.0188 90.5760 17.3724 0.2765 5.7612 3.2666 57.1619
temp: 298.150 k
press: 1.00000 atm
elementType: 8 8 8 6 6 6 6 6 6 6 6 6 6 6 6 6 6 6 1 1 1 1 1 1 1 1 1 1 1 1 1 1 1 1 1 1 1 1 1 1
symmnumber: 1
zpe: 889028.1 jmol-1
zpe.correction: 0.338613 hartree
zpe.thermalcorrener: 0.358676 hartree
zpe.thermalcorrenthalpy: 0.359620 hartree
zpe.thermalcorrgfe: 0.286031 hartree
zpe.sumelectzpe: -809.086835 hartree
zpe.sumelectthermal: -809.066772 hartree
zpe.sumelectthermalent: -809.065827 hartree
zpe.sumelectthermalfe: -809.139417 hartree
dipole: -1.1849 -3.5678 -0.0751
dipole: 3.7601
quadrupole: -105.5934 -105.5453 -110.7703
quadrupole: -16.7147 -0.1964 0.3235
quadrupole: 1.7096 1.7577 -3.4673 -16.7147 -0.1964 0.3235
hfenergy: -809.4254477 hartree
pointgroup: C01 [X(C15H22O3)]
dipole: 0.4653472 1.4042425 0.0064305 debye
polarizability: 261.395413|-16.2384176|174.4673591|-1.7052014|1.3278451|104.663745 unknown
InChI: InChI=1S/C15H22O3/c1-2-3-4-5-6-7-12-18-15(17)13-8-10-14(16)11-9-13/h8-11,16H,2-7,12H2,1H3
charge 0 multiplicity 1
40 atoms
O  -0.880728 -0.364397 -0.021046
O  -1.969611 -2.427111 -0.041965
O  -6.952975 1.712841 0.075307
C  4.075511 0.344177 0.018834
C  5.481058 -0.29087 -0.075612
C  2.932424 -0.691604 -0.070391
C  6.626569 0.741362 0.025675
C  1.529529 -0.043691 -0.001415
C  8.032555 0.107355 -0.078499
C  0.419993 -1.093218 -0.058907
C  9.171329 1.145001 0.024172
C  -2.027328 -1.170331 -0.02037
C  -3.278126 -0.368536 0.007355
C  -4.52147 -1.058223 0.020223
C  -3.269717 1.050276 0.018378
C  -5.73391 -0.351124 0.043455
C  -4.479736 1.769089 0.041007
C  -5.71104 1.065107 0.053381
H  3.988792 0.903671 0.973586
H  3.956627 1.092745 -0.792175
H  5.570053 -0.842903 -1.034782
H  5.597178 -1.046782 0.729251
H  3.043169 -1.428901 0.751972
H  3.030702 -1.263237 -1.01672
H  6.54355 1.289387 0.987757
H  6.509014 1.501376 -0.77522
H  1.429919 0.540221 0.93405
H  1.402866 0.666952 -0.841005
H  8.149357 -0.652556 0.721101
H  8.11496 -0.439266 -1.04021
H  0.45802 -1.692229 -0.988234
H  0.457625 -1.791049 0.798303
H  9.129951 1.684829 0.989185
H  9.095441 1.89756 -0.783493
H  10.164915 0.666209 -0.052705
H  -4.511156 -2.152908 0.011231
H  -2.311944 1.577146 0.008185
H  -6.699009 -0.865174 0.053677
H  -4.468301 2.866674 0.048615
H  -6.843556 2.696435 0.079749
