program: Gaussian 09
title: 000122887
version: EM64L-G09RevD.01
frameworkgroup: C1[X(C9H9NO2)]
method: RPBEPBE
basis: SDD
operation: Freq
keyword: #pfreq=noraman
keyword: PBEPBE/SDD
title: #p freq=noraman PBEPBE/SDD
converged: NO YES NO NO
title: Mulliken charges:
elementType: O O N C C C C C C C C C H H H H H H H H H
charge: -0.262711 -0.187196 0.068956 0.344673 -0.246945 -0.316216 -0.336427 0.376941 -0.378222 -0.350819 -0.682620 -0.132919 0.209951 0.210158 0.251944 0.257867 0.246731 0.250673 0.209243 0.233393 0.233547
chargesum: 0.00000
title: Mulliken charges with hydrogens summed into heavy atoms:
elementType: O O N C C C C C C C C C
charge: -0.262711 -0.187196 0.068956 0.344673 0.173164 -0.064272 -0.078560 0.376941 -0.131492 -0.100147 -0.006437 -0.132919
polarizability: 2.11322637e+02 -1.45541294e+00 9.51241662e+01 -6.51792827e-02 2.58285290e-02 5.22733052e+01
1716.lowfreq: -37.5880 0.0006 0.0006 0.0007 2.7519 7.7937 9.9015 41.9444 80.9268
frequency: -37.5756 41.9383 80.9176 116.1387 140.6094 181.3082 246.1898 282.9126 346.0477 370.2514 414.4880 422.0968 461.7308 481.9717 488.7168 519.4057 631.9876 667.3340 720.2542 784.3931 803.1749 829.0285 837.6274 902.1811 938.6474 959.9946 996.4037 1035.6470 1096.1612 1110.6243 1118.5133 1136.2266 1176.4132 1225.3842 1264.0992 1297.2115 1353.1573 1370.5706 1400.4878 1428.2654 1440.8191 1461.7119 1478.2401 1489.7262 1532.4439 1570.0539 1624.7664 2389.5729 2955.8020 2998.6931 3014.6123 3096.0542 3108.4792 3152.1998 3154.5262 3173.3792 3177.4168
redmass: 9.5180 4.9469 6.3241 1.7394 3.7328 7.3032 1.1965 4.7060 5.6994 7.3800 3.0189 4.5526 11.6850 5.8308 9.9613 2.4240 6.8142 5.7849 3.6204 4.8679 1.2577 1.2118 1.4363 3.3680 1.3727 1.3461 2.9514 2.8030 3.4653 1.4807 1.9152 1.4398 1.2037 3.6042 1.1394 1.2886 3.6127 1.4706 1.2683 3.9639 3.1945 1.0399 1.0672 1.1014 4.7436 7.4574 6.5522 12.7389 1.0554 1.0363 1.1076 1.0989 1.1015 1.0884 1.0884 1.0961 1.0975
irintensity: 0.0696 0.0040 1.3292 2.9580 0.8552 1.7293 1.0379 1.5145 2.1565 0.0500 0.0531 1.7523 9.6263 6.0415 10.3721 25.4299 1.4720 44.9003 0.0088 0.7036 18.5923 35.3467 47.8509 41.7402 1.4517 0.0051 10.1123 79.1411 48.8768 9.0790 11.2113 4.6878 81.2268 264.2919 0.0095 1.8365 1.7485 25.0428 45.5487 10.8751 166.3690 12.2888 9.7502 9.7803 84.7119 6.4636 27.9394 1520.8369 39.3245 25.0358 36.4599 27.9093 33.8049 11.0015 7.4067 13.0361 0.5751
temp: 298.150 k
press: 1.00000 atm
elementType: 8 8 7 6 6 6 6 6 6 6 6 6 1 1 1 1 1 1 1 1 1
symmnumber: 1
zpe: 421665.7 jmol-1
zpe.correction: 0.160604 hartree
zpe.thermalcorrener: 0.171275 hartree
zpe.thermalcorrenthalpy: 0.172220 hartree
zpe.thermalcorrgfe: 0.123562 hartree
zpe.sumelectzpe: -552.680276 hartree
zpe.sumelectthermal: -552.669605 hartree
zpe.sumelectthermalent: -552.668660 hartree
zpe.sumelectthermalfe: -552.717318 hartree
dipole: -4.9190 -1.1471 -0.0013
dipole: 5.0509
quadrupole: -83.9788 -62.7320 -71.8392
quadrupole: 6.8942 -0.0343 0.0119
quadrupole: -11.1288 10.1180 1.0108 6.8942 -0.0343 0.0119
hfenergy: -552.84088 hartree
pointgroup: C01 [X(C9H9N1O2)]
dipole: -1.9244143 0.4946835 -0.0290231 debye
dipolederiv: -2.1660509 0.2583432 0.079093 0.2415168 -0.3459912 0.0043437 0.0907207 0.0031298 -0.2939044 -2.1694393 -0.0266423 0.2082247 -0.0502213 -0.2808918 0.0063279 0.2389012 0.0040731 -0.3051652 -2.175554 -0.0208116 0.2237358 -0.0588981 -0.2734076 0.0514772 0.2380594 0.0471004 -0.2269137 1.7528544 -0.1112571 -0.1262778 0.1842467 0.0131825 0.0202077 -0.2720728 0.0518847 0.0993539 0.9464422 -0.1937729 0.0341614 -0.621249 0.4511874 0.0418695 0.2410523 -0.0042916 0.3753014 -0.372027 0.0707018 -0.0155131 -0.3584501 -0.0337778 -0.0386247 0.1915168 -0.0850107 -0.1754413 -0.4083119 -0.0208761 0.0356298 0.2792695 0.0063559 -0.1115379 -0.1083008 -0.0790392 -0.1133394 1.2069734 0.0355156 -0.1435706 0.0167804 0.0447578 0.0109643 -0.1303524 0.0089691 0.0818862 0.0062447 -0.1164389 0.0382594 0.0860244 0.0535582 -0.1090811 -0.0585128 -0.0861797 -0.1065553 0.0226061 0.0543286 -0.0459898 -0.0656923 0.052981 -0.0946561 0.0117765 -0.1086417 -0.1101626 -0.1542737 -0.0176005 0.0308926 0.0221367 0.0557715 -0.0027666 0.0124045 0.0012005 0.0516638 3.3132403 0.0513406 -0.3344652 0.0843003 0.320555 -0.0166303 -0.371011 -0.0132645 0.3484722 -0.0415827 -0.0794607 -0.0418228 0.0822983 -0.1453623 -0.0728989 -0.0662342 -0.0814628 0.0090154 -0.0247679 -0.0016705 0.0697809 0.1141764 0.0162065 0.0276521 -0.0405161 0.0661073 -0.1681532 0.0159452 0.0863161 -0.0247173 0.1085843 0.0132394 0.0615639 -0.0355055 0.0638674 0.140051 0.0554927 -0.056926 0.0397593 -0.0593855 0.0245172 0.0757565 0.0406875 0.0755595 0.1285428 0.0464785 -0.0588164 0.0412992 -0.0652344 0.0075443 0.0830141 0.0443525 0.0823745 0.1223689 0.0261404 0.086151 -0.0257738 0.0803222 0.0157159 0.0639477 -0.0227607 0.0633977 0.1395014 -0.0638304 0.0959742 -0.0266301 0.1366428 -0.0333542 0.0562083 -0.0462478 0.0605802 0.0919576 0.0858315 -0.0305335 -0.0120278 -0.1070357 -0.0619374 -0.0923122 -0.014948 -0.099432 0.0413911 0.0975885 -0.0038645 -0.0040478 -0.0501326 0.0991497 0.0351748 0.0569907 0.0290782 -0.1298704 unknown
polarizability: 209.856682|-5.6761102|87.3380649|-14.1879883|-16.1622945|61.5253616 unknown
InChI: InChI=1S/C9H9NO2/c1-2-12-9-5-3-8(4-6-9)10-7-11/h3-6H,2H2,1H3
charge 0 multiplicity 1
21 atoms
O  -2.682251 -0.319295 0.475061
O  5.294057 0.023817 -0.552373
N  2.880547 -0.049877 -0.267259
C  -1.307475 -0.172167 0.253343
C  -3.575864 0.774649 0.040419
C  -0.701645 0.957914 -0.353492
C  -0.501782 -1.25762 0.68453
C  1.505686 -0.088395 -0.095771
C  0.697812 0.994932 -0.52504
C  0.890645 -1.218579 0.512998
C  -4.997731 0.349162 0.395026
C  4.079038 -0.010446 -0.403752
H  -3.292987 1.711073 0.563992
H  -3.461371 0.930145 -1.052232
H  -1.30001 1.8074 -0.693786
H  -0.989049 -2.118849 1.1508
H  1.171944 1.863884 -0.992065
H  1.51311 -2.054917 0.845629
H  -5.714036 1.13634 0.097485
H  -5.266923 -0.584657 -0.126776
H  -5.094014 0.180885 1.480962
