program: Gaussian 09
title: 000122873
version: EM64L-G09RevD.01
frameworkgroup: C1[X(C8H12N3O5P)]
method: RPBEPBE
basis: SDD
operation: Freq
keyword: #p
keyword: freq=noraman
keyword: PBEPBE/SDD
title: #p freq=noraman PBEPBE/SDD
converged: YES YES NO NO
title: Mulliken charges:
elementType: P O O O O O N N N C C C C C C C C H H H H H H H H H H H H
charge: 1.250663 -0.220830 -0.483209 -0.669336 -0.596098 -0.251731 -0.188451 -0.053058 -0.622486 0.043325 -0.445923 -0.324860 -0.582734 -0.050893 0.068064 -0.365261 0.192585 0.220442 0.231023 0.293032 0.226857 0.247020 0.294459 0.250925 0.245693 0.397744 0.232660 0.342138 0.318242
chargesum: 0.00000
title: Mulliken charges with hydrogens summed into heavy atoms:
elementType: P O O O O O N N N C C C C C C C C
charge: 1.250663 -0.220830 -0.483209 -0.271591 -0.596098 -0.251731 -0.188451 -0.053058 0.037893 0.263768 0.078131 0.149017 -0.037351 0.194800 0.068064 -0.132602 0.192585
polarizability: 1.89772392e+02 -2.18427300e+01 1.36502526e+02 -8.94451252e+00 -8.29543684e+00 1.18779336e+02
1716.lowfreq: -14.6952 -6.2747 -0.0019 -0.0017 -0.0011 4.7099 22.1269 28.9486 34.1602
frequency: 21.0900 28.9157 33.9979 68.5908 95.0708 140.9583 172.2941 182.2507 201.1849 214.1809 250.3267 276.3892 282.5278 311.5083 321.0220 330.0632 354.8045 385.6232 405.6466 420.4903 430.6213 445.8007 513.1954 543.6545 561.4396 574.3708 575.3655 604.1483 668.3405 694.4448 706.6746 713.4252 743.5468 760.1950 764.0855 786.5236 892.5797 918.4544 923.7498 929.3580 943.6095 982.2008 1002.7302 1006.9715 1033.5401 1063.1896 1067.5858 1084.7967 1123.7035 1183.1281 1198.4177 1209.5329 1221.8483 1251.0228 1260.7742 1310.3030 1326.5412 1343.9244 1349.1726 1358.5822 1382.3136 1407.1118 1440.2526 1456.0989 1485.4842 1511.3033 1601.5409 1637.3834 1654.9381 2936.5643 2982.4875 2995.6183 3008.1301 3066.1876 3088.1555 3124.5170 3139.4664 3185.5449 3540.4601 3591.1100 3698.5561
redmass: 5.6276 6.4459 7.2399 6.2215 5.5796 4.2737 5.2678 6.5335 4.9333 5.9321 2.6175 4.7929 2.6103 2.9095 4.1341 1.9902 3.4948 6.4528 4.0795 2.8216 1.2633 2.4699 5.9123 5.6930 6.2426 6.4991 1.2091 4.1011 8.0357 2.6890 6.6727 6.5962 5.6443 3.5398 1.9929 5.5632 2.4922 2.0524 1.9352 1.3818 7.3762 1.6920 2.4137 3.5501 2.0577 3.6216 4.7866 2.8085 2.0936 2.2045 2.5843 1.2456 1.2559 1.2765 1.2296 1.1799 1.4751 1.4784 1.4411 1.3897 1.7525 1.0780 1.0936 1.1452 4.2202 3.9024 1.7538 2.8293 8.4611 1.0835 1.0641 1.0608 1.0598 1.1009 1.1061 1.0990 1.0910 1.0979 1.0454 1.0662 1.1045
irintensity: 3.9050 1.1421 4.0913 4.3503 1.4287 5.1789 2.0437 1.1155 7.3941 6.1168 16.8885 27.0060 8.6010 21.4393 38.7769 103.0763 6.8496 3.8865 11.4297 7.4633 148.9511 18.5341 7.6115 21.4924 18.3652 12.8692 141.9479 38.4208 143.7137 1.6126 31.9039 72.2724 12.6688 31.6350 69.2517 5.7556 35.1267 43.0317 21.0010 0.6776 54.7417 49.2870 24.7839 93.2165 22.4013 125.5544 79.5461 3.2694 2.4847 41.1081 3.2691 4.0406 18.0353 3.9019 5.0443 7.6210 25.8711 52.1631 15.8830 9.4425 110.1163 9.3323 2.5236 84.8651 123.2560 65.1996 126.0288 322.3731 668.9506 33.4526 22.7146 36.6369 39.8272 10.9495 14.1995 1.3636 6.6852 5.9214 109.8077 69.9444 38.8264
temp: 298.150 k
press: 1.00000 atm
elementType: 15 8 8 8 8 8 7 7 7 6 6 6 6 6 6 6 6 1 1 1 1 1 1 1 1 1 1 1 1
symmnumber: 1
zpe: 559264.4 jmol-1
zpe.correction: 0.213013 hartree
zpe.thermalcorrener: 0.229969 hartree
zpe.thermalcorrenthalpy: 0.230913 hartree
zpe.thermalcorrgfe: 0.166787 hartree
zpe.sumelectzpe: -1192.336398 hartree
zpe.sumelectthermal: -1192.319442 hartree
zpe.sumelectthermalent: -1192.318498 hartree
zpe.sumelectthermalfe: -1192.382624 hartree
dipole: 3.5090 -3.0889 4.0868
dipole: 6.2094
quadrupole: -103.8963 -108.5917 -106.1813
quadrupole: -36.0350 13.6405 9.0908
quadrupole: 2.3268 -2.3686 0.0418 -36.0350 13.6405 9.0908
hfenergy: -1192.5494109 hartree
pointgroup: C01 [X(C8H12N3O5P1)]
dipole: 1.4393925 -1.3700488 -1.4209736 debye
polarizability: 191.2497454|12.4890558|116.494695|-17.8713681|5.2292109|137.3098136 unknown
InChI: InChI=1S/C8H12N3O5P/c9-7-1-2-11(8(12)10-7)3-6-4-16-17(13,14)5-15-6/h1-2,6,13H,3-5,9H2
charge 0 multiplicity 1
29 atoms
P  -3.757892 0.345564 -0.657486
O  -1.067114 0.569538 0.076616
O  -3.390472 -1.309955 -0.194216
O  -4.199178 1.125359 0.830111
O  -4.832666 0.399399 -1.824917
O  1.799206 0.721757 2.33098
N  1.525007 -0.726631 0.493573
N  3.408415 0.810407 0.62112
N  5.012975 0.843577 -1.052076
C  -0.962003 -0.908396 0.165929
C  0.248751 -1.19809 1.065737
C  -2.259555 -1.484378 0.757661
C  -2.006296 1.028324 -0.930062
C  2.022918 -1.254008 -0.675786
C  2.255321 0.330955 1.222971
C  3.196362 -0.790122 -1.237967
C  3.860241 0.292801 -0.539845
H  -0.82263 -1.32369 -0.858381
H  0.301807 -2.285423 1.266783
H  0.140994 -0.661875 2.025871
H  -2.195701 -2.575476 0.907423
H  -2.492934 -0.982292 1.71607
H  -2.030578 2.125656 -0.864611
H  -1.722403 0.703567 -1.951683
H  1.451071 -2.067337 -1.135752
H  -5.170195 1.102794 1.028667
H  3.586413 -1.223616 -2.160656
H  5.448979 1.600014 -0.526504
H  5.424855 0.522976 -1.923869
