program: Gaussian 09
title: 000122872
version: EM64L-G09RevD.01
frameworkgroup: C1[X(C15H19Cl2N3O4)]
method: RPBEPBE
basis: SDD
operation: Freq
keyword: #p
keyword: freq=noraman
keyword: PBEPBE/SDD
title: #p freq=noraman PBEPBE/SDD
converged: YES YES NO NO
title: Mulliken charges:
elementType: Cl Cl O O O O N N N C C C C C C C C C C C C C C C H H H H H H H H H H H H H H H H H H H
charge: -0.025097 -0.021433 -0.333477 -0.477348 -0.431635 -0.439971 -0.273893 -0.382762 -0.093945 -0.104625 -0.164235 -0.168623 -0.038635 -0.366844 0.285972 0.212385 -0.015183 -0.317988 -0.022643 -0.316887 -0.100673 -0.083429 -0.735600 -0.677970 0.257553 0.250909 0.251907 0.266446 0.198584 0.249806 0.391559 0.379373 0.363356 0.263453 0.242764 0.278136 0.352746 0.226239 0.227440 0.223788 0.256238 0.210888 0.203354
chargesum: 0.00000
title: Mulliken charges with hydrogens summed into heavy atoms:
elementType: Cl Cl O O O O N N N C C C C C C C C C C C C C C C
charge: -0.025097 -0.021433 -0.333477 -0.085790 -0.052262 -0.087225 -0.273893 -0.019406 -0.093945 0.152928 0.086674 0.083285 0.227811 0.081546 0.285972 0.212385 -0.015183 -0.054534 0.220122 -0.038751 -0.100673 -0.083429 -0.058133 -0.007490
polarizability: 3.29094814e+02 2.15737026e+01 2.16313908e+02 -5.29907602e+00 1.29494605e+01 1.35340398e+02
1716.lowfreq: -5.6646 -0.0028 -0.0024 0.0007 5.3954 6.9163 24.5663 31.9507 41.1334
frequency: 24.0514 31.9032 41.1332 43.8341 50.7176 67.3852 79.3908 89.1988 108.8248 111.1433 132.5031 179.4060 181.8148 186.4685 219.3696 226.4873 236.8965 246.0841 252.5857 270.2972 285.0267 303.5444 315.5087 327.5495 343.8795 370.4559 375.0785 385.2775 391.4367 415.1735 417.4243 428.7795 461.5432 472.2719 509.6487 527.3838 545.1173 586.5665 606.3917 621.3013 643.8519 650.2042 673.6113 685.6262 726.3963 730.7118 772.2988 790.7479 805.6377 820.1836 837.8258 856.4679 867.8479 898.0656 918.3005 924.8997 928.4800 949.1996 957.2482 967.6211 1006.2962 1009.3742 1036.5066 1052.2314 1076.7925 1087.6677 1110.3214 1123.6133 1134.6010 1159.9067 1163.1135 1183.9101 1191.4519 1204.8911 1211.8282 1222.2330 1254.4939 1259.0969 1270.0182 1294.8531 1299.6152 1314.1215 1318.4114 1334.1230 1338.6532 1347.5715 1351.9633 1355.9309 1374.0414 1376.6960 1378.4175 1392.7797 1397.8859 1400.4490 1454.5296 1458.4351 1462.2239 1465.1210 1471.5691 1483.1420 1491.6905 1559.3988 1602.7396 1629.1523 2976.3627 2977.5587 2982.2517 3003.3959 3004.8299 3009.7443 3024.7006 3050.6320 3069.4417 3080.4656 3094.6112 3097.4411 3097.6068 3158.0948 3184.3590 3475.3472 3520.7807 3562.0849 3565.5830
redmass: 6.3594 6.1357 4.2912 5.8966 3.9588 5.5167 4.4736 6.1584 5.7343 7.3674 5.8980 2.9329 13.1939 8.2077 1.0285 4.4603 4.6342 2.5375 1.9579 4.6108 4.0255 3.3719 1.8091 4.9817 2.8222 4.7836 3.3900 5.3723 1.5939 2.3571 3.4866 4.0194 4.8875 3.1138 1.1964 3.5859 4.9659 1.1873 4.8959 5.8109 5.6822 4.8069 6.2934 7.9254 8.0067 4.3931 5.6315 3.5451 3.6687 1.5420 2.6042 3.9138 1.4874 3.4378 2.6024 1.4581 4.1535 1.5200 3.2587 4.1227 2.8547 2.2070 3.1541 3.8343 3.9128 2.0402 2.2637 3.3750 2.1490 2.6858 1.3021 2.3339 1.4861 2.4536 1.4300 1.2917 3.2592 1.3907 1.3458 2.7235 1.3527 1.3843 1.4064 1.3781 1.2197 1.2975 1.3064 1.3935 4.3110 1.2334 1.2945 1.3589 1.5582 2.5129 1.0854 4.2853 1.3862 1.2545 1.0541 1.0931 1.0826 9.6035 8.7031 10.0308 1.0374 1.0688 1.0361 1.0836 1.0862 1.0848 1.0873 1.0875 1.0997 1.0997 1.0989 1.0996 1.0972 1.0925 1.0930 1.0645 1.0776 1.0662 1.0667
irintensity: 1.7896 0.2939 0.1510 1.1238 1.0819 1.2785 0.2768 6.8487 0.6569 0.0154 1.2281 2.7652 0.3760 0.0949 0.3365 4.6753 4.2758 0.9366 1.8126 0.7834 1.8678 21.9197 77.6175 4.5739 69.0528 7.6658 15.1818 23.7815 180.6500 77.9272 9.3277 8.6359 0.1247 5.2868 104.9902 12.0496 15.9422 72.2826 48.6760 3.6487 20.4596 6.4657 8.7032 5.8144 21.5602 3.3250 26.4217 20.6268 14.0429 46.6478 1.4483 24.4508 30.8671 8.5570 16.0813 2.3153 61.7379 3.4446 45.8581 101.7763 17.9428 25.6162 28.5030 138.3421 12.0358 70.4615 18.7229 1.9796 31.6261 19.8110 8.2647 66.3924 13.6382 44.2588 10.8485 43.5399 48.9047 7.3831 21.7633 47.7306 3.7608 42.1530 19.8147 15.8006 10.8994 8.0496 9.9468 7.7609 32.4730 25.3727 31.8301 44.1760 99.0625 17.8944 8.0959 101.6885 66.7424 70.0835 5.5528 47.7715 2.5501 469.1207 242.9244 302.6874 22.2653 36.8433 29.9905 17.6259 11.7991 7.4602 23.6125 42.3083 19.3116 45.1842 32.8829 26.3756 17.2707 3.3123 0.2571 31.9285 178.4504 9.6587 44.5806
temp: 298.150 k
press: 1.00000 atm
elementType: 17 17 8 8 8 8 7 7 7 6 6 6 6 6 6 6 6 6 6 6 6 6 6 6 1 1 1 1 1 1 1 1 1 1 1 1 1 1 1 1 1 1 1
symmnumber: 1
zpe: 866821.5 jmol-1
zpe.correction: 0.330155 hartree
zpe.thermalcorrener: 0.354423 hartree
zpe.thermalcorrenthalpy: 0.355367 hartree
zpe.thermalcorrgfe: 0.274982 hartree
zpe.sumelectzpe: -1966.433264 hartree
zpe.sumelectthermal: -1966.408996 hartree
zpe.sumelectthermalent: -1966.408052 hartree
zpe.sumelectthermalfe: -1966.488437 hartree
dipole: 3.9225 -1.5525 -1.6332
dipole: 4.5237
quadrupole: -183.5086 -153.3349 -154.3255
quadrupole: 4.5455 -7.0541 6.7142
quadrupole: -19.7856 10.3881 9.3975 4.5455 -7.0541 6.7142
hfenergy: -1966.7634194 hartree
pointgroup: C01 [X(C15H19Cl2N3O4)]
dipole: 1.5463463 0.4919921 0.7309343 debye
polarizability: 319.3045327|-33.2846906|224.473654|26.5880185|-0.2051766|136.9709333 unknown
InChI: InChI=1S/C15H19Cl2N3O4/c1-6(2)18-15-19-9-3-7(16)8(17)4-10(9)20(15)14-13(23)12(22)11(5-21)24-14/h3-4,6,11-14,18,21-23H,5H2,1-2H3
charge 0 multiplicity 1
43 atoms
Cl -4.817271 2.61892 -0.2599
Cl -5.933755 -0.371504 -1.007632
O  2.078496 0.828141 1.073568
O  0.660779 1.430853 -1.854901
O  2.941512 2.724364 -1.982819
O  4.800883 -0.018816 1.240712
N  -0.153374 0.112037 0.443492
N  1.372019 -1.802999 0.529635
N  -0.952221 -1.993988 -0.07957
C  0.734113 1.264031 0.672095
C  0.920561 2.152626 -0.61429
C  2.453732 2.429291 -0.655565
C  3.035707 1.132944 -0.044516
C  4.421585 1.238114 0.578981
C  -1.523741 0.264728 0.138797
C  0.136391 -1.279321 0.290945
C  -1.993489 -1.05795 -0.178885
C  -2.362839 1.391821 0.122554
C  1.680915 -3.23996 0.329267
C  -3.345982 -1.246664 -0.530166
C  -3.715986 1.175968 -0.232745
C  -4.194561 -0.118867 -0.551574
C  2.964476 -3.565748 1.118646
C  1.818689 -3.576701 -1.173533
H  0.323097 1.862082 1.507084
H  0.319113 3.078772 -0.556891
H  2.706619 3.297091 -0.021084
H  2.995221 0.309327 -0.785479
H  4.455999 2.091245 1.28794
H  5.169995 1.397133 -0.213881
H  -0.298421 1.199153 -1.938167
H  2.382074 2.196411 -2.617347
H  2.086346 -1.170309 0.897053
H  -2.029418 2.399837 0.385318
H  0.83028 -3.819196 0.736527
H  -3.727517 -2.239984 -0.777138
H  4.256004 -0.107479 2.06377
H  3.241334 -4.623546 0.971868
H  3.811164 -2.942353 0.770894
H  2.823851 -3.395534 2.201782
H  0.894672 -3.304531 -1.71116
H  1.989625 -4.660626 -1.307473
H  2.670921 -3.031912 -1.620112
