program: Gaussian 09
title: 000122836
version: EM64L-G09RevD.01
frameworkgroup: C1[X(C15H22O)]
method: RPBEPBE
basis: SDD
operation: Freq
keyword: #pfreq=noraman
keyword: PBEPBE/SDD
title: #p freq=noraman PBEPBE/SDD
converged: YES YES NO NO
title: Mulliken charges:
elementType: O C C C C C C C C C C C C C C C H H H H H H H H H H H H H H H H H H H H H H
charge: -0.448879 -0.198517 -0.403043 0.382068 -0.439697 -0.732243 0.125531 -0.375205 -0.309805 -0.575773 0.490022 -0.450167 0.366294 -0.812957 -0.786539 -0.796177 0.251058 0.207780 0.197186 0.218745 0.199120 0.208079 0.212041 0.228074 0.230323 0.212169 0.216482 0.227783 0.221767 0.234370 0.225693 0.213535 0.227060 0.213281 0.214846 0.216778 0.235745 0.353175
chargesum: 0.00000
title: Mulliken charges with hydrogens summed into heavy atoms:
elementType: O C C C C C C C C C C C C C C C
charge: -0.095704 0.052541 0.001923 0.382068 -0.021832 -0.084049 0.125531 -0.144882 -0.097636 -0.359292 0.490022 -0.222384 0.366294 -0.131128 -0.132663 -0.128808
polarizability: 1.78063529e+02 -1.65358770e+01 1.76901839e+02 1.14447674e+01 8.42161420e+00 1.44036197e+02
1716.lowfreq: -9.5148 0.0003 0.0005 0.0007 3.3100 7.8619 9.9496 18.7866 23.2590
frequency: 8.8656 18.2734 23.1148 28.3526 55.1100 86.6994 113.5029 126.2955 160.3430 183.7396 188.9315 209.1303 219.1162 231.0718 274.4365 291.1035 302.8430 319.3548 341.4810 384.6178 414.3686 418.6403 465.0196 474.7327 487.5232 509.3874 542.0660 571.7541 595.1170 688.2740 725.0095 736.7535 755.6316 808.3377 818.9560 839.7205 841.0542 904.3653 930.4915 948.1366 950.0007 953.9412 986.7969 994.5148 1002.8344 1029.1698 1044.5016 1050.2107 1071.9290 1082.2556 1088.4889 1105.5288 1123.3911 1146.6145 1167.2050 1171.9601 1205.6784 1228.5971 1252.1386 1270.5619 1278.9862 1291.9454 1316.4556 1333.2152 1351.2774 1358.0153 1383.8919 1388.1048 1392.0618 1397.6378 1398.2908 1406.5087 1455.5590 1457.3508 1466.1555 1472.1645 1472.8374 1473.4199 1473.7124 1474.7708 1476.1287 1481.3494 1514.5509 1595.1995 1624.0509 1694.9968 2954.8259 2959.0946 2961.5001 2967.3808 2972.0841 2973.4148 3009.7331 3025.1463 3027.3370 3027.9089 3046.6440 3053.9556 3064.4932 3067.2191 3076.7285 3076.8461 3083.1631 3094.0377 3094.8389 3117.1735 3141.9592 3582.7666
redmass: 3.1518 3.6289 3.8126 1.0164 3.1401 2.8051 2.8312 1.0627 2.6622 1.8425 1.3960 4.1725 1.3968 1.9224 2.7061 3.1395 2.5841 3.1762 1.1755 2.4796 2.9185 2.6132 2.8459 3.4205 3.3111 3.6777 2.7808 4.1504 3.2134 3.0378 4.7645 2.9703 1.9611 1.7611 1.3479 1.4571 1.4607 1.8402 2.9870 1.4474 1.3956 1.4731 2.5766 1.2472 1.5675 2.0701 1.5447 2.0745 2.2618 1.6626 2.5935 1.5525 2.2664 1.5929 1.3610 1.4522 1.6317 2.1951 1.4155 1.8022 1.8496 1.3735 1.2760 1.4245 1.6460 1.4443 1.2904 1.3169 3.0391 1.2352 1.2283 3.0873 1.0605 1.0624 1.0686 1.0596 1.0704 1.0467 1.0627 1.0793 1.0743 1.0893 2.9041 6.1944 6.8192 6.4800 1.0372 1.0601 1.0428 1.0584 1.0383 1.0386 1.0914 1.0969 1.0912 1.0954 1.0937 1.0953 1.0940 1.0978 1.0975 1.0990 1.0995 1.0910 1.0955 1.0866 1.0964 1.0659
irintensity: 0.1211 0.0726 0.0548 0.4588 0.7495 0.5198 1.1654 0.1316 0.2649 1.6717 0.4391 0.7442 0.4576 0.4950 1.9203 2.7316 5.5694 3.7870 116.3834 10.7865 5.5197 0.3451 9.5726 3.8678 7.3025 0.0553 2.5129 14.1242 7.4811 1.6417 6.6792 0.0548 2.6163 3.7493 51.0143 4.6481 13.1973 6.1609 20.2729 1.7878 0.6365 0.8637 5.1166 4.9642 0.8233 2.0207 18.7924 22.0978 48.2144 1.8200 19.4577 39.8629 14.7207 40.3247 17.5670 20.0026 25.6799 7.3141 3.7330 2.6334 28.6495 14.3622 3.4980 2.5965 1.0308 2.8138 8.7725 24.1564 6.3922 11.3531 6.2516 33.1017 1.1979 1.5993 3.7186 18.1959 24.7136 20.0088 12.7770 5.9936 6.4274 13.0852 26.4781 23.5943 21.3562 2.0172 44.3410 28.3176 36.2320 32.8084 73.6821 30.3553 5.6243 5.3354 3.1736 58.7254 10.0180 24.5960 8.3159 92.3603 48.4866 47.5931 15.1568 31.2123 34.8931 13.4142 17.9841 23.8977
temp: 298.150 k
press: 1.00000 atm
elementType: 8 6 6 6 6 6 6 6 6 6 6 6 6 6 6 6 1 1 1 1 1 1 1 1 1 1 1 1 1 1 1 1 1 1 1 1 1 1
symmnumber: 1
zpe: 859965.0 jmol-1
zpe.correction: 0.327543 hartree
zpe.thermalcorrener: 0.346355 hartree
zpe.thermalcorrenthalpy: 0.347299 hartree
zpe.thermalcorrgfe: 0.276811 hartree
zpe.sumelectzpe: -658.777812 hartree
zpe.sumelectthermal: -658.759000 hartree
zpe.sumelectthermalent: -658.758056 hartree
zpe.sumelectthermalfe: -658.828544 hartree
dipole: 1.1893 -1.3010 0.6632
dipole: 1.8833
quadrupole: -92.8884 -96.3469 -92.4961
quadrupole: -4.1750 6.8470 0.5128
quadrupole: 1.0220 -2.4364 1.4144 -4.1750 6.8470 0.5128
hfenergy: -659.1053553 hartree
pointgroup: C01 [X(C15H22O1)]
dipole: 0.4797961 -0.481516 0.2948637 debye
polarizability: 178.8858384|-15.5280779|177.4333351|12.2157215|6.1767141|142.6823924 unknown
InChI: InChI=1S/C15H22O/c1-11(2)6-5-7-13(4)14-9-8-12(3)10-15(14)16/h6,8-10,13,16H,5,7H2,1-4H3
charge 0 multiplicity 1
38 atoms
O  1.754612 1.475777 1.940162
C  0.14929 1.980025 -0.380407
C  -1.315447 1.498834 -0.594261
C  1.129631 0.807725 -0.297139
C  -1.852474 0.622289 0.569776
C  0.569086 2.977683 -1.492549
C  1.91816 0.577157 0.861177
C  1.305046 -0.096009 -1.372778
C  -3.313071 0.260341 0.395982
C  2.833381 -0.499298 0.937557
C  2.990559 -1.396607 -0.146077
C  2.212981 -1.175942 -1.310693
C  -3.862701 -0.978139 0.229194
C  3.946831 -2.573343 -0.047964
C  -5.365557 -1.148438 0.062313
C  -3.074071 -2.27623 0.197931
H  0.187664 2.513217 0.58751
H  -1.395086 0.931561 -1.543483
H  -1.964211 2.391602 -0.708478
H  -1.221199 -0.279394 0.66314
H  -1.724065 1.190682 1.515454
H  0.537906 2.503042 -2.49146
H  -0.113265 3.848246 -1.511273
H  1.596833 3.347611 -1.326696
H  0.714875 0.052914 -2.285162
H  -4.001928 1.121495 0.393769
H  3.430283 -0.644527 1.849856
H  2.319693 -1.850723 -2.168007
H  4.834006 -2.328909 0.563406
H  3.455973 -3.448792 0.420478
H  4.297527 -2.889252 -1.045976
H  -5.607293 -1.639216 -0.902051
H  -5.894592 -0.179863 0.095798
H  -5.784304 -1.79603 0.859056
H  -3.278636 -2.832597 -0.738705
H  -3.381051 -2.939831 1.031488
H  -1.985489 -2.122471 0.270032
H  2.343102 1.22081 2.692977
