program: Gaussian 09
title: 000122834
version: EM64L-G09RevD.01
frameworkgroup: C1[X(C18H24O)]
method: RPBEPBE
basis: SDD
operation: Freq
keyword: #pfreq=noraman
keyword: PBEPBE/SDD
title: #p freq=noraman PBEPBE/SDD
converged: YES YES NO NO
title: Mulliken charges:
elementType: O C C C C C C C C C C C C C C C C C C H H H H H H H H H H H H H H H H H H H H H H H H
charge: -0.430939 0.250658 -0.465950 -0.478831 -0.804758 -0.232458 -0.103547 -0.312938 -0.357343 0.370670 -0.588721 0.519285 -0.785992 -0.796509 -0.382437 -0.395348 -0.393539 -0.364469 0.277813 0.213026 0.211221 0.208937 0.223770 0.230878 0.226737 0.215655 0.227393 0.223097 0.214200 0.242428 0.207592 0.228039 0.227506 0.214084 0.214940 0.219938 0.215591 0.233545 0.225901 0.229986 0.217218 0.250192 0.353479
chargesum: 0.00000
title: Mulliken charges with hydrogens summed into heavy atoms:
elementType: O C C C C C C C C C C C C C C C C C C
charge: -0.077461 0.250658 -0.041703 -0.046123 -0.131488 -0.005064 0.119550 -0.098738 -0.114915 0.370670 -0.153090 0.519285 -0.129463 -0.127435 -0.156536 -0.165363 -0.176321 -0.114277 0.277813
polarizability: 2.78617575e+02 -4.20132642e+01 1.96283790e+02 -2.04048870e+01 -1.33641407e+01 1.71347816e+02
1716.lowfreq: -10.6129 -3.4860 0.0003 0.0006 0.0010 5.0185 14.5888 23.6339 27.9580
frequency: 10.1584 22.8630 27.9350 42.1282 64.6265 71.8875 85.5506 112.7323 123.2397 126.3143 162.5103 187.0677 193.2578 218.3164 237.3795 258.8541 269.1396 293.2872 315.1162 352.7390 354.2480 367.7915 373.5636 388.9741 401.7343 412.1414 442.2841 456.1839 464.4765 505.7437 521.9345 551.4187 584.7163 636.5263 678.2442 723.9724 737.6254 759.4735 783.7576 803.5403 805.4207 822.2566 844.5214 846.3402 865.1903 902.3086 931.1621 933.9143 946.4999 951.9561 958.0123 970.1183 983.4840 994.2351 1001.2973 1004.7234 1013.3318 1024.6081 1060.5274 1082.1051 1098.8086 1101.6088 1115.7318 1135.2688 1146.0071 1181.5852 1196.1473 1209.2205 1226.5467 1244.8211 1254.5144 1265.6766 1285.2904 1298.0879 1300.9584 1315.6638 1331.4377 1334.4693 1357.6679 1379.3523 1389.1377 1391.1969 1399.4700 1420.9745 1428.6306 1455.2025 1457.5105 1465.6563 1473.0638 1473.2616 1475.2026 1483.0968 1484.0754 1506.4694 1588.5938 1624.4699 1639.5077 1654.9403 1694.9733 2955.8433 2962.8220 2965.9694 2975.3122 2980.0605 3021.9235 3026.6984 3030.3043 3047.6398 3067.0695 3069.6944 3073.5724 3073.6756 3078.2038 3082.0200 3093.8113 3100.8522 3101.7762 3110.6056 3125.2712 3147.0745 3170.3916 3197.9213 3580.9556
redmass: 3.1518 3.6810 3.5265 3.7160 4.4570 3.5329 3.3352 2.8861 2.1565 1.0589 1.7101 2.8896 1.7637 3.5504 2.5957 1.1533 2.8513 2.4858 2.0344 2.2292 1.2147 3.1546 3.5183 2.4320 2.7301 2.9056 3.0583 2.6184 2.8704 4.3685 2.5222 2.7392 3.0220 6.9026 1.7814 3.3870 2.4486 2.1015 3.7349 1.6194 1.5137 1.5570 1.9077 2.7533 1.9879 1.8651 1.3462 1.3910 1.4559 1.7883 1.3534 1.9107 1.1458 1.2501 2.7601 1.1250 1.7169 1.7777 2.3195 1.6636 1.5379 1.6304 2.0306 2.2428 1.3463 1.1184 2.5371 2.2962 1.9438 1.8887 2.8897 1.4317 1.4660 1.3573 1.3141 1.3264 1.3817 1.2768 1.4350 1.3429 1.3325 3.0060 1.2329 1.2168 3.2017 1.0545 1.0631 1.0612 1.0669 1.0579 1.0556 1.0616 1.0891 2.7094 6.2505 6.2658 4.5176 5.8638 6.4830 1.0373 1.0394 1.0581 1.0623 1.0368 1.0975 1.0969 1.0963 1.0963 1.0932 1.0908 1.0881 1.0909 1.0968 1.0997 1.0957 1.0705 1.0875 1.0886 1.0896 1.0944 1.0952 1.1141 1.0660
irintensity: 0.0454 0.0361 1.0842 0.3238 0.3188 0.1659 0.3417 0.5237 0.1726 0.1866 0.9047 0.0450 0.1957 0.0442 0.3762 0.2091 0.3857 0.6942 0.1813 10.5170 137.6126 2.2280 7.8891 2.8301 0.5781 0.0131 4.6371 3.4663 3.7131 20.5172 12.9965 14.7969 9.8918 1.7152 17.4346 0.6457 8.5977 2.5434 12.6923 14.4848 17.1886 30.1052 22.5468 22.1001 4.2062 3.1453 66.4646 1.9644 0.6608 6.5248 3.5970 2.2936 49.0802 4.3868 1.7615 15.9673 13.0153 3.2250 5.9926 3.1997 51.4221 13.8602 19.1408 12.4375 243.3720 8.1765 0.4425 12.8046 1.9666 18.5519 33.0153 13.1504 2.3012 0.3489 3.7901 4.5882 0.7091 2.8891 3.3893 39.2903 14.0403 37.9246 8.2030 4.6619 16.3084 2.6934 1.9883 3.9122 16.9712 16.0700 5.9228 4.7050 11.9197 97.7094 12.7782 54.6941 30.8977 1.9974 2.5726 45.0739 51.9727 12.3859 30.7649 32.0929 11.2364 7.7401 48.4528 19.0184 20.8217 14.8327 53.7791 22.9644 58.0111 36.1772 40.2151 11.4315 21.8661 19.7052 16.3952 12.3913 9.2354 29.1389 54.8423
temp: 298.150 k
press: 1.00000 atm
elementType: 8 6 6 6 6 6 6 6 6 6 6 6 6 6 6 6 6 6 6 1 1 1 1 1 1 1 1 1 1 1 1 1 1 1 1 1 1 1 1 1 1 1 1
symmnumber: 1
zpe: 959340.7 jmol-1
zpe.correction: 0.365394 hartree
zpe.thermalcorrener: 0.386739 hartree
zpe.thermalcorrenthalpy: 0.387683 hartree
zpe.thermalcorrgfe: 0.312439 hartree
zpe.sumelectzpe: -774.048607 hartree
zpe.sumelectthermal: -774.027262 hartree
zpe.sumelectthermalent: -774.026318 hartree
zpe.sumelectthermalfe: -774.101562 hartree
dipole: -0.4844 -0.7302 1.3334
dipole: 1.5956
quadrupole: -118.9649 -113.5786 -109.1160
quadrupole: -2.6252 6.4081 -8.4500
quadrupole: -5.0784 0.3079 4.7705 -2.6252 6.4081 -8.4500
hfenergy: -774.4140009 hartree
pointgroup: C01[X(C18H24O1)]
dipole: -0.2016332 -0.2892894 0.5193434 debye
polarizability: 280.1323279|-41.0747577|195.7544215|-17.6544047|-14.4982977|170.3624316 unknown
InChI: InChI=1S/C18H24O/c1-5-18(4,13-6-7-15(2)3)14-12-16-8-10-17(19)11-9-16/h5,7-12,14,19H,1,6,13H2,2-4H3
charge 0 multiplicity 1
43 atoms
O  5.894492 -1.65635 0.565566
C  -1.438651 1.938621 -0.11542
C  -2.656976 0.977625 0.063658
C  -2.665016 -0.250262 -0.887584
C  -1.412921 2.540209 -1.547017
C  -0.153649 1.180078 0.233455
C  -1.504682 3.112327 0.877029
C  -3.84562 -1.161717 -0.616991
C  0.972209 1.075142 -0.529536
C  -3.831182 -2.439256 -0.136191
C  -2.41756 3.325097 1.858612
C  2.217729 0.358925 -0.186701
C  -5.128475 -3.202431 0.08765
C  -2.574236 -3.217946 0.212995
C  2.432235 -0.297521 1.058482
C  3.273197 0.311118 -1.14368
C  3.637201 -0.971453 1.333454
C  4.483591 -0.357939 -0.885171
C  4.666244 -1.002912 0.358484
H  -2.670679 0.604418 1.107299
H  -3.591334 1.557952 -0.078135
H  -2.720722 0.103958 -1.936963
H  -1.70658 -0.791232 -0.791162
H  -2.377927 3.031703 -1.764865
H  -1.237442 1.765172 -2.314098
H  -0.617883 3.302281 -1.646446
H  -0.186288 0.703234 1.225608
H  -0.685569 3.838466 0.750911
H  -4.830788 -0.712136 -0.82415
H  0.979788 1.558863 -1.51619
H  -2.349057 4.206012 2.507374
H  -3.255564 2.645129 2.046169
H  -6.012051 -2.599398 -0.185345
H  -5.233694 -3.506639 1.14859
H  -5.150498 -4.135091 -0.511208
H  -2.495605 -4.13129 -0.410162
H  -2.608667 -3.558503 1.267303
H  -1.64997 -2.634158 0.074888
H  1.652057 -0.280428 1.826969
H  3.13671 0.808891 -2.111717
H  3.778968 -1.468672 2.302452
H  5.289155 -0.391438 -1.6244
H  5.923512 -2.075251 1.461382
