program: Gaussian 09
title: 000122837
version: EM64L-G09RevD.01
frameworkgroup: C1[X(C20H32O)]
method: RPBEPBE
basis: SDD
operation: Freq
keyword: #pfreq=noraman
keyword: PBEPBE/SDD
title: #p freq=noraman PBEPBE/SDD
converged: YES YES NO NO
title: Mulliken charges:
elementType: O C C C C C C C C C C C C C C C C C C C C H H H H H H H H H H H H H H H H H H H H H H H H H H H H H H H H
charge: -0.453656 -0.227123 -0.022656 -0.285218 -0.190880 -0.447475 -0.061441 -0.502509 0.394777 0.593377 -0.627420 -0.424560 -0.452882 -0.788584 -0.821318 -0.788707 -0.473281 -0.304957 0.367624 -0.784155 -0.793159 0.234195 0.207236 0.218768 0.210041 0.218819 0.208279 0.200148 0.205344 0.223317 0.218243 0.212864 0.234949 0.207010 0.216092 0.216970 0.231801 0.215367 0.331919 0.217331 0.221480 0.242179 0.213532 0.220115 0.221520 0.206610 0.214333 0.228150 0.215653 0.215227 0.221406 0.227119 0.218187
chargesum: 0.00000
title: Mulliken charges with hydrogens summed into heavy atoms:
elementType: O C C C C C C C C C C C C C C C C C C C C
charge: -0.121737 0.007072 0.184581 -0.066450 0.019160 -0.020377 0.138706 -0.073847 0.394777 0.593377 -0.196313 -0.189611 -0.029780 -0.124446 -0.140328 -0.355061 -0.045151 -0.090623 0.367624 -0.125125 -0.126447
polarizability: 2.41279057e+02 5.63174213e+00 2.10199502e+02 -1.36337882e+01 -4.04269166e+00 1.98450050e+02
1716.lowfreq: -13.3039 -5.3907 -0.0007 -0.0004 0.0002 7.3748 12.7681 17.0714 28.3683
frequency: 10.1533 13.4943 26.2438 38.5425 56.2654 76.2016 88.8866 95.7594 119.8093 145.3311 147.2437 163.9655 176.6080 184.4939 194.2945 203.5744 223.5174 248.8379 261.9116 283.8562 286.3729 293.5242 310.8154 325.6631 331.4653 355.1626 376.3402 390.6032 398.4379 416.5047 454.2972 484.8226 491.4491 496.9000 524.7372 572.8934 587.1169 618.1065 645.9288 671.9216 715.4044 741.8544 773.3002 792.4263 799.4624 814.0100 828.0241 858.5259 862.8380 891.5722 898.0863 924.5222 940.4723 946.3811 947.6841 961.2761 962.8579 975.4432 979.5704 994.4403 1008.8948 1010.0374 1016.6494 1024.8721 1040.0911 1045.7403 1058.1585 1081.4882 1081.7447 1086.0115 1115.1906 1124.1227 1129.5312 1138.7116 1152.4585 1178.7171 1181.8534 1194.2951 1200.8622 1203.9231 1230.2861 1234.8962 1249.2089 1261.5509 1268.1324 1272.3042 1279.6064 1289.1117 1294.0336 1297.5034 1308.4009 1315.2354 1317.5430 1321.9811 1335.5928 1346.2128 1350.4486 1359.4773 1365.2860 1385.2568 1388.0477 1390.0184 1398.0611 1399.1983 1428.9745 1454.6464 1454.7265 1458.5460 1459.8597 1467.7281 1468.0576 1470.6749 1470.7687 1474.0168 1475.8086 1479.1291 1481.8684 1489.9028 1653.8868 1666.4273 1695.7951 2919.8700 2938.2373 2946.1029 2955.8470 2956.6495 2961.6889 2963.3552 2963.9839 2966.8346 2968.7329 2973.7997 2974.7349 2977.3755 2985.2888 3010.3494 3026.6440 3027.1665 3027.8434 3031.1243 3041.2817 3045.3975 3049.8353 3062.2173 3065.0073 3078.6794 3079.0886 3082.8767 3084.2940 3092.0380 3140.9626 3183.5854 3555.3597
redmass: 3.6664 2.8099 3.6887 3.4297 3.2932 2.9783 2.9299 2.5223 1.1952 1.1636 2.5262 2.6905 2.0831 1.3455 1.9333 1.8407 1.9795 2.1554 3.0870 2.9226 2.2625 1.1540 3.2028 2.8176 3.1500 3.9795 2.5423 2.8643 2.5910 2.4330 2.3374 2.4118 3.1126 2.8215 2.8672 2.6204 2.8919 2.9940 3.4410 2.2706 1.3903 1.3939 2.3490 2.2683 1.3086 2.1830 1.6777 2.0268 2.8369 2.1936 2.6998 1.3648 1.7375 2.0847 1.4017 1.8924 1.9157 1.9100 1.8238 1.2500 2.0373 1.9399 1.8735 1.8888 2.2902 1.7183 2.1796 1.6674 2.0582 1.7478 2.6847 1.8043 2.3239 1.6273 1.8359 1.2340 1.5036 1.3352 1.5669 2.1385 1.5648 1.6202 1.6208 1.3039 1.3628 1.2389 1.4813 1.2582 1.4221 1.5518 1.4016 1.9788 1.6905 1.2418 1.3674 1.3596 1.3523 1.4441 1.3673 1.4191 1.3064 1.2754 1.2294 1.2770 1.1907 1.0520 1.0520 1.0713 1.0716 1.0749 1.0657 1.0480 1.0742 1.0801 1.0651 1.0898 1.0811 1.0503 5.2779 6.8491 6.4923 1.0803 1.0809 1.0809 1.0665 1.0373 1.0670 1.0393 1.0635 1.0741 1.0381 1.0558 1.0506 1.0760 1.0629 1.0948 1.0990 1.0981 1.0970 1.0963 1.0952 1.0922 1.1014 1.0975 1.0936 1.0997 1.0973 1.0977 1.0623 1.0957 1.0956 1.1137 1.0656
irintensity: 0.0566 0.0294 0.0549 0.1258 0.0795 0.2513 0.6842 0.3667 0.0218 0.4052 0.0445 0.1285 0.6690 1.7873 0.5982 1.5705 1.0350 3.5383 16.3898 1.5851 5.6263 91.7725 3.2152 0.5626 1.1675 7.8931 0.4813 0.7048 1.6832 0.6236 2.6301 1.6826 6.7770 3.3449 1.8689 11.0076 5.5347 10.7935 1.2822 0.0809 1.2345 6.6579 5.4795 0.1613 24.2852 3.5774 7.4587 22.2972 24.1144 0.9529 0.4889 66.4287 8.1246 14.1524 0.7014 0.7892 6.7241 9.3367 0.4706 4.0936 4.3015 4.4649 3.1981 20.4423 18.4147 2.6252 0.7626 3.1653 8.9030 2.2874 2.0226 20.1596 11.9992 1.6174 10.4198 2.2887 2.9026 2.4137 2.2930 2.9177 11.9060 32.5167 17.2608 12.0176 2.1837 5.8210 7.0067 6.4682 4.6795 5.2070 0.3628 2.5224 1.9020 7.3576 2.6250 0.9668 2.5918 5.6934 1.8487 8.4915 16.5136 21.9949 10.2633 17.4154 5.9673 10.0010 6.9368 6.7331 3.1952 8.6640 4.5775 19.3900 12.4880 12.5639 11.4280 14.8656 7.3107 18.6239 29.8615 6.6707 3.3657 20.1927 12.1386 25.7294 41.0035 36.6882 45.4360 52.5737 35.7066 26.7168 30.3603 13.9269 51.0267 30.7982 67.1919 31.8084 35.0393 23.6056 5.9176 49.8856 26.7776 20.4452 49.4319 47.1823 34.7989 30.7418 47.6988 47.3320 10.8008 35.5926 27.8299 23.2103 2.2202
temp: 298.150 k
press: 1.00000 atm
elementType: 8 6 6 6 6 6 6 6 6 6 6 6 6 6 6 6 6 6 6 6 6 1 1 1 1 1 1 1 1 1 1 1 1 1 1 1 1 1 1 1 1 1 1 1 1 1 1 1 1 1 1 1 1
symmnumber: 1
zpe: 1231065.1 jmol-1
zpe.correction: 0.468888 hartree
zpe.thermalcorrener: 0.492886 hartree
zpe.thermalcorrenthalpy: 0.493830 hartree
zpe.thermalcorrgfe: 0.413148 hartree
zpe.sumelectzpe: -854.832461 hartree
zpe.sumelectthermal: -854.808463 hartree
zpe.sumelectthermalent: -854.807519 hartree
zpe.sumelectthermalfe: -854.888201 hartree
dipole: 2.3189 -0.7306 0.1018
dipole: 2.4334
quadrupole: -130.7276 -128.2968 -131.7907
quadrupole: 0.1645 -2.1639 1.3936
quadrupole: -0.4559 1.9749 -1.5190 0.1645 -2.1639 1.3936
hfenergy: -855.3013489 hartree
pointgroup: C01 [X(C20H32O1)]
dipole: 0.9194732 0.2632182 -0.0429988 debye
polarizability: 240.9921806|-6.3375375|210.4475044|13.5274891|-4.4813851|198.4889244 unknown
InChI: InChI=1S/C20H32O/c1-13(2)7-6-8-14(3)18-12-9-15(4)17-11-10-16(5)19(17)20(18)21/h7,10,14,17-21H,4,6,8-9,11-12H2,1-3,5H3
charge 0 multiplicity 1
53 atoms
O  -1.043946 -0.075181 2.514171
C  -2.108832 -0.713915 0.453298
C  -0.354463 1.23948 0.478532
C  -2.384028 -0.286786 -1.02208
C  -0.803691 -0.138483 1.05098
C  -1.431757 2.359049 0.569557
C  0.986928 1.724648 1.138249
C  -3.262403 -1.443019 -1.603506
C  -2.203747 -2.245349 0.390904
C  -2.927037 1.137403 -1.184307
C  -2.866386 2.039307 0.041329
C  -2.851582 -2.630083 -0.7439
C  2.119202 0.650709 1.149319
C  1.506979 3.038048 0.493706
C  -1.728054 -3.131222 1.513504
C  -3.444099 1.572499 -2.364361
C  2.581882 0.159195 -0.251346
C  3.683033 -0.877146 -0.154079
C  4.946853 -0.821261 -0.666537
C  5.923401 -1.969134 -0.457134
C  5.503096 0.336555 -1.477529
H  -2.923562 -0.355204 1.116644
H  -0.13871 1.070777 -0.597562
H  -1.411691 -0.351044 -1.557788
H  0.017137 -0.861071 0.85072
H  -1.05453 3.225955 -0.003223
H  -1.519448 2.68515 1.625819
H  0.762944 1.963337 2.203509
H  -3.089804 -1.60207 -2.684521
H  -4.341802 -1.213728 -1.481597
H  -3.372504 2.997186 -0.184092
H  -3.447142 1.568911 0.85823
H  -3.106645 -3.666045 -0.994107
H  1.816563 -0.232998 1.748854
H  2.995578 1.080712 1.674261
H  1.541756 2.96286 -0.60968
H  0.871575 3.902981 0.748945
H  2.529854 3.262828 0.849809
H  -0.193042 0.154496 2.966965
H  -0.639187 -3.023441 1.684928
H  -1.93814 -4.195132 1.305547
H  -2.214301 -2.850514 2.466958
H  -3.509681 0.921735 -3.244945
H  -3.823977 2.594238 -2.482373
H  2.903915 1.024778 -0.85657
H  1.713731 -0.286225 -0.781249
H  3.410052 -1.780949 0.415816
H  5.475011 -2.788542 0.13121
H  6.259945 -2.387059 -1.427171
H  6.835169 -1.624662 0.071116
H  5.78014 0.000347 -2.496796
H  4.795443 1.175008 -1.580368
H  6.429904 0.72767 -1.012461
