program: Gaussian 09
title: 000122710
version: EM64L-G09RevD.01
frameworkgroup: C1[X(C8H4F6N2O2)]
method: RPBEPBE
basis: SDD
operation: Freq
keyword: #p
keyword: freq=noraman
keyword: PBEPBE/SDD
title: #p freq=noraman PBEPBE/SDD
converged: YES YES NO NO
title: Mulliken charges:
elementType: F F F F F F O O N N C C C C C C C C H H H H
charge: -0.140711 -0.121825 -0.138152 -0.137930 -0.141179 -0.121245 -0.235634 -0.207682 0.048655 0.011778 -0.209444 0.392991 0.392258 0.262791 0.019216 -0.301031 -0.285512 -0.220314 0.331261 0.285401 0.258378 0.257928
chargesum: 0.00000
title: Mulliken charges with hydrogens summed into heavy atoms:
elementType: F F F F F F O O N N C C C C C C C C
charge: -0.140711 -0.121825 -0.138152 -0.137930 -0.141179 -0.121245 -0.235634 -0.207682 0.048655 0.011778 0.121817 0.392991 0.392258 0.262791 0.019216 -0.015629 -0.027133 0.037614
polarizability: 1.53006496e+02 8.59491472e-02 6.31798328e+01 -9.55794681e+00 -2.39659311e-01 1.08747090e+02
1716.lowfreq: -7.0350 -0.0007 -0.0004 0.0011 1.0364 7.7216 17.4500 26.2856 33.0616
frequency: 17.4051 25.9972 33.0488 48.3427 53.9660 89.6568 125.0201 135.6387 182.5573 226.7407 239.1483 262.5431 295.5084 297.7365 307.5913 355.1933 409.2394 442.0741 450.6079 462.9243 468.3678 476.9388 570.7786 598.4892 599.2299 640.6575 692.2856 693.9428 764.1918 780.3081 834.1491 847.1188 865.9817 955.3004 963.4834 969.3756 975.5589 976.3812 1014.0663 1015.9652 1050.2115 1071.9786 1093.5964 1155.7412 1200.1658 1202.3483 1238.5363 1256.6278 1289.2898 1308.3911 1355.6122 1383.6661 1432.9024 1501.6635 1520.8658 1645.2201 3021.9670 3146.7200 3165.2660 3171.3544
redmass: 12.1508 7.6360 11.7378 14.7985 13.0564 9.8338 15.5319 4.5654 11.5951 12.5962 12.9489 16.7683 10.7329 16.7168 6.8414 4.3953 12.1576 9.4090 12.9845 17.3796 13.2311 14.6964 10.7728 9.8794 11.9425 14.4435 6.9247 10.4278 2.4912 8.6046 5.6280 6.9543 1.5257 1.4517 7.2328 1.5276 7.1273 5.9495 12.2813 5.7252 3.4472 8.9538 10.7683 2.1237 8.0255 5.7938 7.3818 3.0681 1.5059 1.4474 1.5017 1.8405 1.9777 7.8630 4.5235 12.3991 1.0825 1.0890 1.0935 1.0996
irintensity: 0.1957 0.3296 0.2369 0.3657 0.8024 0.9897 1.2222 0.0583 4.0876 0.6669 0.9807 0.3010 8.2528 5.2481 0.3278 4.4969 3.7929 14.8502 11.4583 4.1812 6.0980 1.5701 25.2917 0.2971 42.0093 11.9871 7.4056 6.5170 17.3064 2.2136 61.9652 79.9493 21.4272 1.4643 16.7026 0.0672 130.1269 30.5573 2.8602 150.1442 106.6266 580.4531 205.8019 0.4679 172.1945 130.2847 72.4978 75.9508 3.2701 141.5151 46.8872 26.0867 5.0355 2.1396 17.2427 146.1383 34.2260 0.0913 12.5376 15.6604
temp: 298.150 k
press: 1.00000 atm
elementType: 9 9 9 9 9 9 8 8 7 7 6 6 6 6 6 6 6 6 1 1 1 1
symmnumber: 1
zpe: 319257.2 jmol-1
zpe.correction: 0.121599 hartree
zpe.thermalcorrener: 0.137880 hartree
zpe.thermalcorrenthalpy: 0.138824 hartree
zpe.thermalcorrgfe: 0.074009 hartree
zpe.sumelectzpe: -1164.896341 hartree
zpe.sumelectthermal: -1164.880059 hartree
zpe.sumelectthermalent: -1164.879115 hartree
zpe.sumelectthermalfe: -1164.943930 hartree
dipole: -3.6606 -0.0096 0.5666
dipole: 3.7042
quadrupole: -94.0351 -104.5555 -100.9887
quadrupole: 0.0528 -12.2649 0.0305
quadrupole: 5.8247 -4.6958 -1.1289 0.0528 -12.2649 0.0305
hfenergy: -1165.0179397 hartree
pointgroup: C01 [X(C8H4F6N2O2)]
dipole: 1.4293392 -0.2605957 -0.113877 debye
dipolederiv: -0.5166508 -0.1873469 0.0121238 -0.2280768 -0.6092708 0.1089209 0.0215892 0.1612475 -0.3469254 -0.3119698 -0.0128579 -0.0784388 0.0079017 -0.4260878 -0.1318767 -0.1413057 -0.2002081 -0.6520946 -0.8170687 0.1725218 0.0892877 0.3090038 -0.3725926 -0.0174571 -0.0152869 0.0208408 -0.3501374 -0.8805997 0.1228727 0.1134708 -0.0192309 -0.3549604 0.000477 0.2076873 -0.0343507 -0.3071221 -0.4414774 0.0354164 -0.1318249 0.0451101 -0.439832 0.2380907 -0.1763734 0.1906998 -0.5922295 -0.3329899 -0.0755028 -0.029267 -0.1287372 -0.5345281 -0.2467438 -0.0124897 -0.1736893 -0.5191819 -1.6211057 -0.0732355 -0.296059 -0.2321454 -0.3280067 -0.078681 -0.4937353 -0.0538293 -0.436643 -0.7742152 0.1408723 0.105006 -0.0034711 -0.5018546 -0.2934006 -0.0772109 -0.2722859 -0.6326847 -0.0796258 0.0071049 0.0288294 -0.1292534 -0.1760638 0.0208756 -0.1474258 0.0416663 -0.1764576 -0.2287495 0.0280326 0.0425254 0.0184623 -0.2682363 0.0027025 0.0300064 0.0039714 -0.2584649 0.5240688 -0.0274689 0.0535517 -0.244307 -0.0319384 -0.0389551 -0.2256939 -0.0094212 -0.0716531 1.5824876 -0.0503374 0.0287341 -0.1121317 1.4486909 0.0166416 0.2071495 -0.0177077 1.4342413 1.631586 0.0087044 -0.0231934 0.1998446 1.4034721 0.0058868 -0.0367907 0.0202031 1.4377126 2.1581437 -0.1324501 0.1185539 0.1780375 0.587904 0.4640986 0.5122545 0.4182214 0.8580375 -0.2512261 -0.0280388 -0.0889152 0.1725548 -0.0095085 -0.0966608 0.1699723 -0.1277418 -0.0529411 -0.0026379 0.0565394 0.0659154 0.0072736 0.1100183 0.0838895 0.0004103 0.0914681 0.1662676 -0.3643484 0.1201264 0.0965087 -0.1082609 0.1530707 0.1557201 -0.198588 0.1907608 0.2375418 0.3870786 -0.1780332 -0.1777636 0.0548033 0.026665 -0.0063516 0.1255852 -0.0423032 0.0027828 0.1577579 -0.023786 -0.0208161 0.0879862 0.0812816 0.003343 0.1221286 -0.0127608 0.090712 0.1307206 0.0145371 0.0176261 0.0314588 0.0878167 -0.0622331 0.0407496 -0.064893 0.0609798 0.0829446 0.0129615 0.0091815 0.0447576 0.0550023 -0.0935757 0.0502586 -0.0985508 0.011956 -0.032123 0.0693678 0.0649637 0.0484202 0.0989586 -0.0347108 0.037109 -0.0313378 0.0963039 unknown
polarizability: 151.8534144|-12.9172784|81.771954|-3.0642447|22.0871413|91.3080499 unknown
InChI: InChI=1S/C8H4F6N2O2/c9-7(10,11)6(8(12,13)14)18-5(17)4-3-15-1-2-16-4/h1-3,6H
charge 0 multiplicity 1
22 atoms
F  -1.361202 2.228015 -1.267808
F  -2.363001 0.401407 -2.16174
F  -3.489872 1.699571 -0.681574
F  -3.788743 -0.557471 0.98703
F  -1.862515 -1.529967 1.695008
F  -2.580626 -1.852034 -0.430593
O  -0.319735 -0.085052 -0.139248
O  0.489359 1.211325 1.638113
N  2.173245 -0.885579 -0.808982
N  4.455045 -0.00764 0.685466
C  -1.66948 0.351282 0.207752
C  -2.227891 1.152031 -0.988516
C  -2.480962 -0.903768 0.592929
C  0.711564 0.439195 0.683971
C  2.059799 -0.045404 0.26526
C  3.190239 0.391159 1.00825
C  3.436177 -1.280616 -1.127285
C  4.567586 -0.846528 -0.388039
H  -1.645837 1.025568 1.08679
H  3.075891 1.062647 1.863937
H  3.539269 -1.952442 -1.984979
H  5.578887 -1.170499 -0.653542
