program: Gaussian 09
title: 000122686
version: EM64L-G09RevD.01
frameworkgroup: C1[X(C14H16N2O4)]
method: RPBEPBE
basis: SDD
operation: Freq
keyword: #p
keyword: freq=noraman
keyword: PBEPBE/SDD
title: #p freq=noraman PBEPBE/SDD
converged: YES YES NO NO
title: Mulliken charges:
elementType: O O O O N N C C C C C C C C C C C C C C H H H H H H H H H H H H H H H H
charge: -0.260163 -0.230743 -0.275306 -0.225354 -0.272023 -0.359286 -0.070442 -0.431089 -0.396717 0.256239 0.423979 -0.366088 -0.346099 -0.363007 -0.367094 0.325902 0.255560 0.115479 -0.767239 -0.789468 0.268030 0.251477 0.257860 0.235593 0.263367 0.325054 0.247609 0.305231 0.243032 0.280952 0.255474 0.256424 0.216955 0.236356 0.236452 0.263092
chargesum: 0.00000
title: Mulliken charges with hydrogens summed into heavy atoms:
elementType: O O O O N N C C C C C C C C C C C C C C
charge: -0.260163 -0.230743 -0.275306 -0.225354 -0.272023 -0.034232 0.197588 0.078247 0.102243 0.256239 0.423979 -0.118478 -0.040867 -0.119975 -0.086143 0.325902 0.255560 0.115479 -0.038385 -0.053568
polarizability: 3.03321259e+02 3.85645181e+00 1.73862627e+02 1.35940549e+01 -9.00073837e+00 9.54325865e+01
1716.lowfreq: -9.3917 -5.4803 -1.8698 -0.0008 -0.0005 0.0003 3.0554 32.9939 37.9849
frequency: -5.6247 32.9885 37.9668 40.5349 57.6556 60.4070 74.8651 87.3874 108.5764 134.4786 139.0519 184.3548 204.0030 216.4847 247.5694 275.6455 314.0786 325.1731 355.2208 411.8945 426.0925 440.7281 459.0166 503.8472 504.9070 561.9387 580.0068 591.9245 596.2814 618.3045 624.7157 632.0006 668.2748 674.7087 717.6825 741.5126 760.0198 817.4302 831.7399 879.3953 880.3481 924.9947 944.1030 945.7723 956.1800 981.8905 1002.7696 1012.7500 1028.6600 1038.4045 1044.2691 1060.4374 1068.9130 1081.7045 1106.8645 1128.1062 1132.3207 1181.2889 1201.4854 1204.2922 1243.4667 1262.7120 1280.8676 1299.0142 1306.8228 1317.6876 1324.7720 1362.2511 1368.4170 1377.6067 1387.5374 1391.0815 1430.0741 1447.3426 1448.3361 1450.2848 1462.1398 1466.9476 1489.3784 1497.6460 1510.2253 1559.5675 1594.6181 1618.6853 1623.8717 1698.1121 2982.3410 2984.0397 2985.6985 2999.2282 3040.6381 3053.0677 3068.6392 3074.8095 3099.2780 3104.3300 3125.2453 3143.7940 3155.2152 3166.2920 3192.7966 3559.7221
redmass: 5.4522 4.7835 3.5545 3.8019 5.9504 1.5351 2.8160 3.9389 4.9370 2.2354 1.4001 6.0361 4.4904 5.1189 5.6834 2.6625 5.3147 4.2128 5.3776 2.9634 3.6492 3.0824 3.4661 3.5829 4.1380 4.4848 2.3873 2.3230 4.5200 2.8828 1.6470 6.7698 5.2893 10.6033 5.4122 3.5888 6.6476 1.4226 3.9315 1.8234 1.8803 4.8327 2.2745 1.9609 1.5694 1.6606 3.2091 1.4081 1.6990 2.3806 1.8398 2.9459 3.3703 2.4661 2.4315 2.9788 1.4901 4.1454 1.1367 1.1961 1.3414 1.7813 3.5654 1.4421 1.6002 1.2883 1.6328 2.1021 1.4115 1.4392 2.9917 1.2712 3.5842 1.0980 1.1092 1.0456 1.0501 1.0997 1.8171 1.1670 2.4333 6.5465 7.5227 6.3173 6.3342 11.8581 1.0603 1.0375 1.0605 1.0361 1.1033 1.0994 1.0970 1.0920 1.0984 1.1005 1.0990 1.0872 1.0907 1.0957 1.0947 1.0782
irintensity: 2.0969 5.9445 4.0862 3.3648 0.4268 8.0553 0.8283 7.4653 3.5387 0.5018 1.7188 2.5243 0.6142 20.0381 1.1781 4.8876 0.5388 1.6665 2.7875 0.0602 0.3373 6.1038 11.0921 18.7563 25.5291 2.0609 49.3761 18.6306 7.6181 25.8054 40.5635 1.8567 22.8136 9.5704 22.4041 0.3249 1.1324 38.5198 4.4045 40.7872 23.9259 192.8028 26.1848 31.4493 4.0164 0.1100 1.8059 0.1042 1.2709 94.9170 31.6718 13.8488 145.3436 114.0336 14.1796 27.3778 29.0489 302.3296 3.0460 60.2260 6.2678 149.3241 275.6316 17.4162 142.3165 7.7752 85.1605 107.9909 199.6186 1.9282 59.9438 39.5948 17.3412 41.9570 33.3710 16.6095 20.7829 52.0275 288.6502 19.4623 31.9972 95.7500 200.7815 177.0350 150.4390 365.7595 40.3307 4.1587 29.2157 9.3634 12.6183 5.6277 13.4373 28.8908 10.1263 16.6367 19.2504 11.0989 2.8791 12.8409 3.6076 28.1055
temp: 298.150 k
press: 1.00000 atm
elementType: 8 8 8 8 7 7 6 6 6 6 6 6 6 6 6 6 6 6 6 6 1 1 1 1 1 1 1 1 1 1 1 1 1 1 1 1
symmnumber: 1
zpe: 740602.2 jmol-1
zpe.correction: 0.282080 hartree
zpe.thermalcorrener: 0.300750 hartree
zpe.thermalcorrenthalpy: 0.301694 hartree
zpe.thermalcorrgfe: 0.232989 hartree
zpe.sumelectzpe: -952.051146 hartree
zpe.sumelectthermal: -952.032477 hartree
zpe.sumelectthermalent: -952.031533 hartree
zpe.sumelectthermalfe: -952.100238 hartree
dipole: 2.5872 -3.6810 0.5802
dipole: 4.5365
quadrupole: -138.9315 -127.4599 -116.1910
quadrupole: 31.2610 -5.6686 -1.9332
quadrupole: -11.4040 0.0676 11.3364 31.2610 -5.6686 -1.9332
hfenergy: -952.3332265 hartree
pointgroup: C01 [X(C14H16N2O4)]
dipole: -1.0258086 -1.4370979 -0.2607181 debye
polarizability: 303.8036977|-4.2787207|173.0733868|8.8539563|12.0463879|95.7393875 unknown
InChI: InChI=1S/C14H16N2O4/c1-9(17)11-3-5-12(6-4-11)16-8-13(20-14(16)19)7-15-10(2)18/h3-6,13,15H,7-8H2,1-2H3
charge 0 multiplicity 1
36 atoms
O  -2.217701 1.278064 -0.305121
O  -0.410271 2.687117 0.109779
O  -5.860886 -1.911115 0.175002
O  6.326922 0.627691 0.392745
N  -0.130779 0.33186 -0.251283
N  -4.62317 -0.002693 0.654678
C  -2.443712 -0.187021 -0.513826
C  -1.022741 -0.814319 -0.524817
C  -3.339648 -0.701961 0.62123
C  -0.838455 1.543427 -0.121284
C  1.279439 0.173671 -0.149868
C  1.843162 -1.122706 -0.320621
C  2.143486 1.276716 0.116881
C  3.233968 -1.311083 -0.227319
C  3.527356 1.068444 0.207377
C  4.102513 -0.221556 0.038635
C  -5.822661 -0.665707 0.416387
C  5.59065 -0.37429 0.147735
C  -7.075295 0.199976 0.472196
C  6.206027 -1.758819 -0.041736
H  -2.95904 -0.285151 -1.483041
H  -0.920308 -1.587147 0.260863
H  -0.785868 -1.274087 -1.50093
H  -2.805233 -0.587634 1.585308
H  -3.567171 -1.773312 0.464852
H  -4.61096 1.007992 0.802004
H  1.206603 -1.987364 -0.528365
H  1.721477 2.274642 0.247406
H  3.637819 -2.319627 -0.364051
H  4.20138 1.906874 0.412225
H  -7.627964 0.095107 -0.476863
H  -7.734837 -0.172485 1.275105
H  -6.865034 1.268467 0.649997
H  5.967511 -2.168019 -1.041221
H  5.821145 -2.472485 0.710702
H  7.298579 -1.681269 0.063637
