program: Gaussian 09
title: 000122691
version: EM64L-G09RevD.01
frameworkgroup: C1[X(C18H13NO3)]
method: RPBEPBE
basis: SDD
operation: Freq
keyword: #p
keyword: freq=noraman
keyword: PBEPBE/SDD
title: #p freq=noraman PBEPBE/SDD
converged: YES YES NO NO
title: Mulliken charges:
elementType: O O O N C C C C C C C C C C C C C C C C C C H H H H H H H H H H H H H
charge: -0.321201 -0.300859 -0.149982 0.074134 0.285739 0.139469 0.240423 0.525538 -0.323244 0.230261 0.009836 -0.242324 0.247207 -0.655428 -0.374818 -0.348563 -0.403029 -0.378480 -0.246867 -0.245584 -0.527164 -0.524534 0.267518 0.308473 0.244486 0.297120 0.250897 0.230797 0.238658 0.264885 0.233601 0.235416 0.256661 0.234393 0.226568
chargesum: 0.00000
title: Mulliken charges with hydrogens summed into heavy atoms:
elementType: O O O N C C C C C C C C C C C C C C C C C C
charge: -0.321201 -0.300859 -0.149982 0.074134 0.285739 0.139469 0.240423 0.525538 -0.323244 0.230261 0.009836 -0.242324 0.247207 -0.387910 -0.066345 -0.104077 -0.105909 -0.127582 -0.016071 -0.006926 0.206736 0.193088
polarizability: 3.02076483e+02 8.08774398e+00 2.93209810e+02 -3.68048501e-01 3.67389555e+00 9.51909228e+01
1716.lowfreq: -9.7091 -7.5793 -0.0007 -0.0004 -0.0004 4.3567 34.1552 46.4761 65.3076
frequency: 34.1207 46.2794 65.2925 97.5778 107.9406 117.3782 140.7042 152.9048 156.2463 178.6085 231.8361 241.1652 258.5075 311.0632 314.4957 324.8818 343.5893 355.6998 377.8810 387.3040 429.9849 433.4555 443.6510 496.9761 521.1958 554.7928 582.1857 599.9150 628.8846 636.2882 657.1742 673.5901 709.1846 742.1908 766.1356 772.2788 806.3601 832.2630 840.9844 873.1956 880.2140 887.8917 907.7325 938.3171 942.0497 955.9342 974.8657 999.3470 1013.7374 1019.4413 1045.3415 1071.4782 1090.6940 1107.4570 1109.0788 1111.0829 1147.8434 1154.8543 1174.5322 1183.1099 1198.7734 1210.9357 1267.0005 1275.1333 1290.5909 1335.7053 1352.7330 1372.4622 1378.2220 1399.5921 1404.0474 1426.1851 1432.6829 1441.7019 1458.7547 1460.6803 1466.2844 1476.2060 1479.3443 1483.7126 1523.4308 1558.6824 1566.6596 1575.7282 1610.2666 1614.3318 2979.2812 2985.1955 3080.8021 3090.4823 3129.0628 3129.5057 3132.2484 3133.9277 3149.2679 3156.8741 3161.0025 3165.2716 3205.8496
redmass: 6.3676 3.9842 3.6369 2.7524 3.9951 3.7708 3.8496 1.1223 1.1816 3.9695 4.3647 4.9407 4.8921 7.4756 6.5631 6.0115 9.2399 7.4239 6.2731 5.2580 3.6049 7.4299 6.9900 4.4126 4.3240 8.1960 4.6745 6.7089 4.3622 6.2887 7.0199 6.0167 4.4746 6.6052 2.9113 2.6957 2.1799 6.6449 1.4383 8.2452 2.2488 5.4686 1.7137 3.6253 3.5845 9.6132 1.4624 1.3953 1.3798 4.8912 2.3635 3.4213 2.1588 1.2421 1.7954 1.5958 1.3462 1.4553 1.2285 1.4683 2.2657 2.1926 1.7629 4.3281 2.8208 3.8606 4.7750 3.8290 6.2844 3.7328 2.5040 1.4094 1.3549 2.5428 1.0541 1.0920 3.3004 1.0562 2.7164 1.0596 9.2179 9.5539 6.3743 7.0936 7.1568 7.0975 1.0308 1.0295 1.1041 1.1054 1.1033 1.1039 1.0868 1.0874 1.0914 1.0986 1.0931 1.0990 1.0930
irintensity: 2.2799 0.2417 4.3906 9.5610 0.7067 3.9110 0.6870 0.4148 0.4731 0.9807 4.0926 6.9703 4.3203 12.2695 7.1117 4.3193 2.3284 2.8206 0.4811 1.0743 0.3238 1.4976 8.3797 1.0263 1.4506 1.8585 23.9719 5.4316 6.5082 5.2221 8.2106 4.0199 11.0066 2.9057 25.5911 13.6445 25.0371 3.6265 16.8379 18.6224 1.5416 8.7555 49.7447 14.0833 17.0459 113.0140 0.4136 5.3187 1.8550 50.9401 4.0752 25.5669 7.2762 20.7731 25.0174 12.3385 1.3522 5.7441 0.6462 1.8897 91.4636 5.4566 17.1469 166.7914 110.1705 52.9660 11.7661 26.1419 34.1242 28.9189 36.3189 34.8836 13.3394 19.4702 16.7251 1.0367 5.7835 2.3484 49.9156 32.7277 13.3073 66.2702 20.9231 84.7591 23.2352 10.7389 79.6098 57.7575 21.5111 18.1943 19.4826 15.9132 7.9368 4.4458 9.4032 37.0434 5.3941 25.8669 10.1245
temp: 298.150 k
press: 1.00000 atm
elementType: 8 8 8 7 6 6 6 6 6 6 6 6 6 6 6 6 6 6 6 6 6 6 1 1 1 1 1 1 1 1 1 1 1 1 1
symmnumber: 1
zpe: 690949.8 jmol-1
zpe.correction: 0.263169 hartree
zpe.thermalcorrener: 0.281118 hartree
zpe.thermalcorrenthalpy: 0.282062 hartree
zpe.thermalcorrgfe: 0.217148 hartree
zpe.sumelectzpe: -972.605820 hartree
zpe.sumelectthermal: -972.587870 hartree
zpe.sumelectthermalent: -972.586926 hartree
zpe.sumelectthermalfe: -972.651840 hartree
dipole: 6.8003 -3.4463 -0.2841
dipole: 7.6291
quadrupole: -131.1480 -110.1572 -125.9917
quadrupole: 12.7378 -1.4890 -2.5417
quadrupole: -8.7156 12.2751 -3.5594 12.7378 -1.4890 -2.5417
hfenergy: -972.8689886 hartree
pointgroup: C01 [X(C18H13N1O3)]
dipole: 2.4284485 1.7513147 0.2110572 debye
polarizability: 304.2784156|-6.5120476|290.5628783|3.7771116|9.2162509|95.6359221 unknown
InChI: InChI=1S/C18H13NO3/c1-21-13-9-10-7-8-19-16-14(10)15(18(13)22-2)11-5-3-4-6-12(11)17(16)20/h3-9H,1-2H3
charge 0 multiplicity 1
35 atoms
O  1.663345 2.305804 -0.048017
O  3.990671 0.74982 0.023704
O  -3.451679 -1.773035 -0.302484
N  -1.102592 -3.251606 -0.167356
C  0.235599 0.292824 0.026113
C  0.200034 -1.156814 -0.030001
C  -1.049078 1.037365 0.096071
C  1.422837 -1.930824 -0.05767
C  -1.036784 -1.896572 -0.10892
C  -2.287396 0.321767 -0.015075
C  1.51553 0.903705 -0.009955
C  -2.348348 -1.16384 -0.158583
C  2.730709 0.118993 0.025164
C  2.68646 -1.267653 -0.007234
C  -1.124957 2.447906 0.306398
C  1.330515 -3.354034 -0.113779
C  -3.527949 1.008315 0.036955
C  0.070294 -3.961476 -0.154372
C  -2.363935 3.114359 0.365804
C  -3.577365 2.399618 0.218823
C  2.224779 2.835659 -1.320408
C  4.302799 1.556621 1.230313
H  3.621754 -1.835261 0.00976
H  -0.201436 3.011874 0.430506
H  2.242435 -3.960152 -0.12688
H  -4.43787 0.407596 -0.060258
H  -0.034847 -5.051039 -0.187722
H  -2.382192 4.197317 0.532119
H  -4.539296 2.921274 0.259781
H  3.217195 2.394804 -1.514461
H  2.306194 3.922588 -1.170635
H  1.531101 2.617091 -2.152329
H  3.545797 2.344859 1.383195
H  5.290183 2.00001 1.033464
H  4.355793 0.897839 2.117066
