program: Gaussian 09
title: 000122671
version: EM64L-G09RevD.01
frameworkgroup: C1[X(C11H13N3O5)]
method: RPBEPBE
basis: SDD
operation: Freq
keyword: #p
keyword: freq=noraman
keyword: PBEPBE/SDD
title: #p freq=noraman PBEPBE/SDD
converged: YES YES NO NO
title: Mulliken charges:
elementType: O O O O O N N N C C C C C C C C C C C H H H H H H H H H H H H H
charge: -0.282074 -0.492778 -0.438963 -0.437947 -0.258611 -0.356237 -0.371035 0.003864 -0.125987 -0.269021 -0.158829 0.018226 0.328376 -0.371025 0.116035 -0.374479 0.027225 0.004780 -0.280509 0.243868 0.273683 0.221344 0.274137 0.196313 0.200155 0.296137 0.373892 0.359237 0.338089 0.358723 0.347981 0.235428
chargesum: 0.00000
title: Mulliken charges with hydrogens summed into heavy atoms:
elementType: O O O O O N N N C C C C C C C C C C C
charge: -0.282074 -0.118885 -0.079725 -0.089966 -0.258611 -0.018147 -0.012312 0.003864 0.117881 0.004662 0.062514 0.292363 0.328376 0.025443 0.116035 -0.078342 0.027225 0.004780 -0.045081
polarizability: 2.10582882e+02 -3.06064521e+00 1.64001668e+02 -4.16232733e+00 -1.77893900e+00 8.84907401e+01
1716.lowfreq: -4.8363 -0.0011 -0.0011 -0.0008 6.0810 12.4077 25.4753 49.9437 55.8833
frequency: 25.3811 49.9282 55.8821 69.6983 94.2754 113.1962 151.4556 158.8488 200.4506 212.2739 226.6333 262.2149 269.4928 289.9738 297.0921 311.2395 328.0101 352.5649 408.4175 484.1802 494.5252 514.5393 531.8500 540.9621 581.7463 589.2284 608.2543 620.1538 641.0873 670.6606 677.6205 694.1944 756.3887 771.7356 811.6849 820.4993 853.0221 871.1351 879.3096 901.8574 961.8701 967.5947 985.0810 989.9524 1002.8104 1011.0592 1029.3650 1053.7660 1065.5933 1091.5408 1099.8413 1118.2388 1163.0506 1196.4947 1214.9191 1221.3734 1244.8768 1252.0337 1254.7377 1275.7360 1289.2962 1317.1175 1321.6462 1326.7155 1336.9230 1362.0998 1369.6276 1380.0045 1395.6229 1422.9802 1441.1389 1459.3669 1498.3620 1514.1700 1567.5996 1592.9139 1615.6226 2921.3700 2935.6365 2977.7269 2992.2937 3034.3757 3042.8978 3123.9081 3252.4922 3444.6025 3467.2985 3572.6965 3575.4325 3596.8968
redmass: 5.6857 6.3897 7.0099 6.5714 4.0574 7.6146 4.6857 4.7876 6.9161 1.2658 2.6225 4.6713 5.2837 3.2331 4.4393 5.3584 1.9700 5.7999 3.7308 2.2501 6.0747 3.6196 2.0844 2.6636 6.0202 5.2684 4.9485 5.6663 1.3343 3.9855 4.6828 6.1357 1.2656 5.7436 1.9396 2.6801 3.1170 3.7483 6.6965 1.4359 6.1739 6.3427 4.1341 4.1403 2.7881 3.3627 3.6124 2.6075 3.0512 1.8863 1.9212 2.1529 1.1773 1.2477 1.0876 1.2988 1.8791 1.8382 1.3726 1.4315 1.3118 1.2344 1.2546 2.0288 1.6010 1.6761 1.5823 1.7143 2.1940 1.5935 3.2752 1.0806 4.0470 6.2207 6.6573 6.6527 7.5868 1.0814 1.0558 1.0864 1.1041 1.0865 1.0876 1.0920 1.0992 1.0808 1.0650 1.0663 1.0667 1.0815
irintensity: 0.7950 1.8507 11.4659 2.5707 9.7425 5.7729 4.3933 3.9235 3.5261 141.5970 12.7245 22.3125 5.0688 33.5715 13.5533 9.0957 18.5952 4.7594 18.6427 49.4259 33.1040 2.8926 101.8854 72.2101 26.7058 3.6752 37.7339 12.0896 62.1672 21.1077 21.7767 2.7099 117.6837 3.3466 15.0184 18.0217 8.4850 40.5699 4.1080 8.5064 161.4317 16.7134 41.5279 31.9942 36.1700 32.2650 43.3570 34.9724 15.2437 21.3634 12.7387 30.2159 24.9521 20.5895 6.5856 39.0478 13.3999 19.6143 14.7265 22.4083 3.6143 7.1743 79.9520 17.2168 3.2137 34.7425 17.3655 16.4145 32.6683 1.8699 83.7012 7.7146 59.6580 77.1404 32.7805 117.5867 438.3981 22.6065 47.3369 63.6119 42.3873 23.7389 30.9676 23.1099 2.7223 243.5437 23.0923 20.7911 5.4127 107.6686
temp: 298.150 k
press: 1.00000 atm
elementType: 8 8 8 8 8 7 7 7 6 6 6 6 6 6 6 6 6 6 6 1 1 1 1 1 1 1 1 1 1 1 1 1
symmnumber: 1
zpe: 637253.3 jmol-1
zpe.correction: 0.242717 hartree
zpe.thermalcorrener: 0.259896 hartree
zpe.thermalcorrenthalpy: 0.260840 hartree
zpe.thermalcorrgfe: 0.196951 hartree
zpe.sumelectzpe: -965.899305 hartree
zpe.sumelectthermal: -965.882125 hartree
zpe.sumelectthermalent: -965.881181 hartree
zpe.sumelectthermalfe: -965.945071 hartree
dipole: 8.1383 2.9015 4.0487
dipole: 9.5416
quadrupole: -159.0878 -90.6272 -107.7146
quadrupole: -9.2651 18.3723 1.4152
quadrupole: -39.9446 28.5160 11.4286 -9.2651 18.3723 1.4152
hfenergy: -966.1420217 hartree
pointgroup: C01 [X(C11H13N3O5)]
dipole: -3.2589961 -0.9297182 1.6145858 debye
polarizability: 210.0766947|-5.7817464|164.560947|3.8990531|0.7140697|88.437649 unknown
InChI: InChI=1S/C11H13N3O5/c15-2-5-8(16)9(17)10(19-5)4-1-12-7-6(4)13-3-14-11(7)18/h1,3,5,8-10,12-13,15-17H,2H2
charge 0 multiplicity 1
32 atoms
O  -2.033956 1.074756 -0.3531
O  -0.969321 -2.346352 0.415804
O  -3.440708 -1.979099 -0.643293
O  -4.626277 2.475151 -0.080026
O  4.990933 1.111757 0.245107
N  2.082335 1.988269 -0.039003
N  1.83603 -1.564395 -0.117686
N  4.205536 -1.129756 0.113949
C  -1.04496 -0.011735 -0.44597
C  -1.553739 -1.001818 0.630042
C  -3.093552 -0.996746 0.382657
C  -3.37324 0.42868 -0.174741
C  0.330997 0.545652 -0.237025
C  -4.230143 1.313782 0.722278
C  1.552314 -0.19769 -0.124914
C  0.701815 1.90067 -0.182175
C  2.628552 0.708159 -0.002297
C  4.02161 0.300501 0.128737
C  3.168358 -1.945177 0.001671
H  -1.123305 -0.518541 -1.435582
H  -1.304372 -0.621539 1.637768
H  -3.659979 -1.21139 1.311606
H  -3.859844 0.321406 -1.16244
H  -5.123035 0.733162 1.043042
H  -3.647569 1.615059 1.619116
H  0.05816 2.773629 -0.246757
H  -1.029884 -2.869298 1.254724
H  -2.735199 -2.683175 -0.628758
H  2.644974 2.835973 0.024859
H  1.059143 -2.236912 -0.144153
H  -5.100446 3.129571 0.491207
H  3.346675 -3.027755 -0.000948
