program: Gaussian 09
title: 000122767
version: EM64L-G09RevD.01
frameworkgroup: C1[X(C9H14N5O4P)]
method: RPBEPBE
basis: SDD
operation: Freq
keyword: #p
keyword: freq=noraman
keyword: PBEPBE/SDD
title: #p freq=noraman PBEPBE/SDD
converged: YES YES NO NO
title: Mulliken charges:
elementType: P O O O O N N N N N C C C C C C C C C H H H H H H H H H H H H H H
charge: 1.225589 -0.245167 -0.742786 -0.686352 -0.645296 -0.144577 -0.081010 -0.278586 -0.050587 -0.600094 0.005170 -0.461415 0.286199 -0.699973 -0.105200 -0.215060 -0.566618 0.171828 -0.269688 0.253397 0.225247 0.330060 0.215511 0.238989 0.228655 0.277265 0.283220 0.251776 0.262328 0.352403 0.342059 0.455038 0.387674
chargesum: 0.00000
title: Mulliken charges with hydrogens summed into heavy atoms:
elementType: P O O O O N N N N N C C C C C C C C C
charge: 1.225589 -0.245167 -0.287748 -0.298678 -0.645296 -0.144577 -0.081010 -0.278586 -0.050587 0.094368 0.258567 0.093892 0.286199 -0.016819 -0.105200 0.062205 -0.031621 0.171828 -0.007360
polarizability: 2.26832792e+02 -3.03186272e+00 1.79326693e+02 -1.14396868e+00 1.32032453e+01 1.07304617e+02
1716.lowfreq: -9.4930 -5.4533 0.0012 0.0013 0.0013 4.4617 39.7281 45.3047 76.0208
frequency: 39.6672 45.2820 76.0123 90.9925 99.9903 128.8893 133.4306 142.8634 155.4487 185.2673 206.7185 212.5938 229.6153 246.1396 267.4405 285.3578 305.7323 311.6844 331.2672 345.3461 363.0850 393.6614 424.4982 506.6791 527.2727 539.0079 548.8484 558.3179 567.1070 585.1363 637.3806 645.4021 668.5700 691.5095 709.7238 746.2431 789.9206 798.1175 808.8462 827.5519 876.5407 892.5882 912.5907 918.3644 930.6996 966.9083 998.9058 1021.1511 1032.3445 1037.8869 1056.8867 1079.6112 1132.3622 1157.0808 1181.3929 1191.2178 1226.8313 1232.6341 1242.1030 1295.2212 1308.7050 1309.9868 1333.0500 1333.7689 1349.7139 1371.2155 1379.0659 1393.6352 1401.9236 1410.7124 1424.5671 1440.7100 1461.2211 1473.0607 1479.5647 1492.9107 1551.8363 1584.9530 1638.9619 1859.4736 2984.6487 2988.4516 2989.2118 3004.0461 3072.5289 3085.5258 3100.3498 3122.1142 3179.7024 3234.8704 3533.6398 3605.6650 3687.0538
redmass: 6.2935 6.0648 3.9820 6.8351 5.3270 6.8430 1.7133 5.7456 5.9726 4.0788 1.2646 3.0896 3.1969 2.9070 3.7627 3.5195 3.6964 5.3760 5.2088 4.8952 6.9490 3.8607 2.9413 3.5121 8.8844 4.1756 2.2336 1.3543 1.2221 5.3570 5.7570 4.1250 8.8555 7.9411 6.6210 6.6532 5.8632 2.7314 6.2660 1.6664 2.8153 6.3749 1.4093 1.7649 1.4353 2.3804 1.3471 5.0519 4.6688 4.6781 2.6723 2.2174 2.1368 1.7470 1.6780 1.9288 1.3330 1.7202 1.9951 3.8127 1.3768 1.6607 1.6105 1.8311 1.4487 1.8170 1.2324 1.3208 6.5883 1.0961 1.4540 2.4727 1.0487 1.1346 1.7904 1.4567 6.1957 1.7969 2.9236 1.1535 1.0685 1.0450 1.0759 1.0618 1.1001 1.0990 1.1001 1.1017 1.0933 1.0989 1.0446 1.0661 1.1056
irintensity: 0.1781 1.8286 0.1872 6.4217 6.2122 12.5983 60.4354 5.8345 14.1121 5.6275 6.0826 22.4268 11.8347 18.3949 16.6159 4.1877 3.2924 6.2889 162.6463 19.1161 35.4133 11.9391 22.7906 7.8058 23.1617 5.2747 68.9282 90.3620 88.5492 20.3388 8.7673 46.0222 18.3978 258.2636 87.3118 67.5275 14.9135 11.0897 75.2193 9.4320 8.8301 1.9611 5.5760 48.0243 13.5129 6.7211 112.2346 108.7631 60.5691 16.0641 30.3907 26.1208 33.8647 198.5569 18.6322 20.3632 58.5092 20.4487 40.5106 34.1975 0.8532 13.1551 42.3253 84.2536 12.6941 79.0437 2.3007 42.3374 33.3082 7.2649 39.5947 27.5988 9.7554 9.0285 13.8526 21.5481 309.7822 31.0459 992.8162 3744.9310 34.1413 19.0140 5.6257 29.1489 10.0713 32.0991 20.6972 3.8916 4.0311 0.1809 157.1032 45.6047 56.9385
temp: 298.150 k
press: 1.00000 atm
elementType: 15 8 8 8 8 7 7 7 7 7 6 6 6 6 6 6 6 6 6 1 1 1 1 1 1 1 1 1 1 1 1 1 1
symmnumber: 1
zpe: 646861.4 jmol-1
zpe.correction: 0.246377 hartree
zpe.thermalcorrener: 0.265062 hartree
zpe.thermalcorrenthalpy: 0.266006 hartree
zpe.thermalcorrgfe: 0.199861 hartree
zpe.sumelectzpe: -1265.818617 hartree
zpe.sumelectthermal: -1265.799931 hartree
zpe.sumelectthermalent: -1265.798987 hartree
zpe.sumelectthermalfe: -1265.865132 hartree
dipole: 5.0892 2.0214 -2.1507
dipole: 5.8831
quadrupole: -108.7431 -111.2271 -127.9643
quadrupole: -2.2577 5.2452 0.7075
quadrupole: 7.2350 4.7511 -11.9861 -2.2577 5.2452 0.7075
hfenergy: -1266.0649932 hartree
pointgroup: C01 [X(C9H14N5O4P1)]
dipole: 1.8393683 0.8059103 -1.1509121 debye
polarizability: 223.0135646|-0.6883133|178.5508347|-20.8624177|15.599516|111.8997035 unknown
InChI: InChI=1S/C9H14N5O4P/c1-6(18-5-19(15,16)17)2-14-4-13-7-8(10)11-3-12-9(7)14/h3-4,6,15-16H,2,5,10H2,1H3
charge 0 multiplicity 1
33 atoms
P  -3.125989 -1.022904 0.8128
O  -3.075862 1.768253 0.384187
O  -2.037021 -1.520511 -0.378718
O  -4.516937 -2.028285 0.55654
O  -2.530685 -0.975926 2.299961
N  0.645195 1.190422 0.510897
N  2.89474 1.496094 0.120691
N  0.469359 -1.187871 -0.257119
N  2.608967 -2.099205 -1.001531
N  4.595227 -0.826158 -1.005208
C  -1.716062 1.754186 -0.215419
C  -0.730751 1.485856 0.962634
C  1.125335 -0.013527 -0.00337
C  -1.495887 3.11293 -0.883773
C  2.512719 0.191624 -0.234698
C  1.753393 2.056375 0.559513
C  -3.888032 0.588169 0.143486
C  3.258787 -0.908329 -0.750799
C  1.277526 -2.176514 -0.752446
H  -1.64575 0.933028 -0.957751
H  -0.693454 2.381612 1.606973
H  -1.096357 0.648082 1.586733
H  -0.458292 3.207552 -1.253947
H  -2.180851 3.239498 -1.738863
H  -1.693283 3.926118 -0.162558
H  1.661227 3.073236 0.935418
H  -4.837502 0.760377 0.672053
H  -4.07096 0.41039 -0.933291
H  0.789485 -3.129375 -0.972879
H  5.094741 0.042254 -0.821469
H  5.08159 -1.643802 -1.369022
H  -0.951298 -1.397519 -0.235009
H  -4.368516 -2.99343 0.718386
