program: Gaussian 09
title: 000122718
version: EM64L-G09RevD.01
frameworkgroup: C1[X(C18H16O7)]
method: RPBEPBE
basis: SDD
operation: Freq
keyword: #pfreq=noraman
keyword: PBEPBE/SDD
title: #p freq=noraman PBEPBE/SDD
converged: YES YES NO NO
title: Mulliken charges:
elementType: O O O O O O O C C C C C C C C C C C C C C C C C C H H H H H H H H H H H H H H H H
charge: -0.250549 -0.140717 -0.392901 -0.191790 -0.394493 -0.169392 -0.324389 -0.068033 0.139997 0.440490 0.160349 -0.421785 0.041234 -0.718350 0.001112 -0.552269 0.180030 0.085078 0.200914 -0.029018 0.221691 0.207785 -0.881054 -0.783874 -0.753721 0.279132 0.242413 0.242411 0.264081 0.285461 0.231974 0.309510 0.233018 0.385037 0.266726 0.243671 0.261151 0.385713 0.251478 0.256300 0.255580
chargesum: 0.00000
title: Mulliken charges with hydrogens summed into heavy atoms:
elementType: O O O O O O O C C C C C C C C C C C C C C C C C C
charge: -0.250549 -0.140717 -0.007864 -0.191790 -0.008780 -0.169392 -0.324389 -0.068033 0.139997 0.440490 0.160349 -0.142653 0.041234 0.030554 0.001112 -0.266808 0.180030 0.085078 0.200914 -0.029018 0.221691 0.207785 -0.106551 -0.012327 0.009636
polarizability: 3.14127705e+02 -5.63169186e+00 2.42674884e+02 1.90372508e+01 3.77263723e+00 1.38135478e+02
1716.lowfreq: -7.4965 -2.6781 -0.0005 -0.0003 0.0003 6.5422 22.6940 36.6322 44.9014
frequency: 22.6871 36.6146 44.8973 58.6738 76.4545 88.1925 111.2869 123.7903 135.4811 142.5563 146.0707 148.0654 157.0010 168.7357 199.9434 207.5116 214.6577 235.8540 241.2403 256.4805 271.3351 291.9910 297.3267 316.2991 337.3944 369.5080 374.4163 380.2615 395.2746 424.6818 426.2408 461.4460 481.1125 503.2494 511.6905 540.3315 550.0892 566.2162 586.2691 591.0412 626.0985 637.5638 643.5530 667.1672 684.8298 700.7577 730.2562 770.7897 816.7522 835.9804 842.7830 861.6914 886.6938 886.8843 911.8228 963.9001 969.5986 997.2156 1015.2548 1021.7956 1024.8551 1031.3796 1034.6763 1045.8734 1047.5136 1093.2547 1104.8679 1136.6802 1141.0768 1153.3585 1185.5098 1191.2027 1198.9201 1229.2448 1252.3743 1290.3776 1296.8165 1346.7461 1361.6075 1365.9288 1383.1706 1388.1206 1394.4143 1406.4557 1418.8128 1433.3557 1440.9509 1450.9899 1452.8144 1458.5515 1466.4465 1478.1657 1484.8658 1491.0616 1565.9995 1575.3896 1615.4726 1628.7829 1640.6212 1660.1856 1673.7886 2496.0194 2958.1454 2980.1992 2996.2653 3000.7996 3007.1015 3026.8311 3065.6671 3084.4844 3098.6250 3109.6324 3110.7138 3126.9250 3132.4262 3183.1595 3562.0289
redmass: 5.8509 4.4351 5.0682 7.9177 4.5723 6.1231 1.4415 2.0536 3.3374 5.4135 1.0927 1.2605 5.8179 4.7994 5.0424 2.4328 3.9340 3.8750 1.5139 4.8657 3.4385 4.4744 3.5097 4.7850 3.6009 2.3187 6.7310 3.6579 4.5959 3.6714 6.3486 5.3427 5.6465 4.2270 5.4097 5.7209 4.9516 3.8292 5.0188 8.3356 4.6669 5.3498 5.9415 5.2714 7.1746 3.8965 4.4627 7.2356 5.3644 2.3887 4.5373 2.4346 2.8124 2.9951 2.5783 2.3585 1.9227 2.0897 2.9569 2.1075 1.2436 1.4308 3.3017 1.4157 3.8848 3.1996 2.9226 2.0991 2.4862 2.4478 2.0863 1.7111 2.8775 1.9679 3.3059 3.1567 3.2676 3.7526 5.0299 1.2548 1.1959 1.3999 1.5253 3.1720 3.1341 1.3830 1.0679 1.0467 1.0529 1.5297 1.0660 1.0670 1.8539 1.0447 3.1212 10.4634 8.2812 10.9220 4.3641 9.0485 8.3593 1.0785 1.0408 1.0370 1.0346 1.0371 1.0803 1.0984 1.0964 1.0957 1.1008 1.0930 1.1021 1.1001 1.1013 1.0939 1.0654
irintensity: 2.4264 3.9569 0.6228 1.4221 1.1816 3.9460 0.3096 1.1741 1.4648 0.7121 0.3100 1.5240 0.8838 2.0430 1.6711 0.9272 3.5795 4.5262 3.5684 1.8737 12.4287 0.3048 4.4693 5.0459 9.8808 48.5413 4.6534 15.0389 24.6276 38.0010 6.5001 11.7523 7.5191 0.9588 35.9409 2.9918 0.8400 0.4563 19.0334 8.5416 7.9832 0.4325 1.2595 6.5568 1.4375 24.4827 6.2077 5.1769 2.4893 14.8915 12.2852 19.3228 18.9582 36.9483 15.9433 45.5898 7.9160 21.8208 47.1451 6.9553 102.7554 13.8482 246.4838 22.9864 61.3678 9.2922 102.0458 205.8615 53.2474 26.2682 133.3963 67.2625 298.4332 2.9204 22.7038 126.7031 6.4576 147.8534 101.9288 73.6159 22.7737 143.5285 59.5354 31.5299 182.9188 54.7059 17.9701 20.2574 28.2071 6.7396 19.1226 2.2336 140.9268 19.2828 23.3156 380.6114 405.4083 82.2750 277.7170 90.2985 213.4745 462.9396 32.2137 1.1570 12.3287 0.0326 1.5679 19.5798 3.3913 4.9769 20.3452 0.2252 6.0113 13.7061 16.8793 3.1152 63.0811
temp: 298.150 k
press: 1.00000 atm
elementType: 8 8 8 8 8 8 8 6 6 6 6 6 6 6 6 6 6 6 6 6 6 6 6 6 6 1 1 1 1 1 1 1 1 1 1 1 1 1 1 1 1
symmnumber: 1
zpe: 789197.2 jmol-1
zpe.correction: 0.300589 hartree
zpe.thermalcorrener: 0.324691 hartree
zpe.thermalcorrenthalpy: 0.325636 hartree
zpe.thermalcorrgfe: 0.247141 hartree
zpe.sumelectzpe: -1220.271131 hartree
zpe.sumelectthermal: -1220.247028 hartree
zpe.sumelectthermalent: -1220.246084 hartree
zpe.sumelectthermalfe: -1220.324579 hartree
dipole: -1.1350 4.0710 3.8288
dipole: 5.7027
quadrupole: -170.6914 -132.0346 -149.1362
quadrupole: 9.9243 1.7132 2.1533
quadrupole: -20.0707 18.5861 1.4845 9.9243 1.7132 2.1533
hfenergy: -1220.5717199 hartree
pointgroup: C01 [X(C18H16O7)]
dipole: 0.516215 -1.487389 1.5984513 debye
polarizability: 312.1835708|-7.5056011|241.5694527|-26.0943663|-11.0308039|141.1850444 unknown
InChI: InChI=1S/C18H16O7/c1-6-14(22)12(8(3)20)16-13(15(6)23)18(4)10(25-16)5-9(21)11(7(2)19)17(18)24/h5,11,22-23H,1-4H3
charge 0 multiplicity 1
41 atoms
O  0.469065 1.735148 0.142246
O  -1.785204 -1.829892 -0.764679
O  0.698683 -2.931962 0.822194
O  -4.306063 1.928253 0.9191
O  4.680456 -0.691681 -0.803071
O  -4.176024 0.370269 -1.913055
O  4.657107 1.765177 -1.12506
C  -0.75156 -0.242553 0.823986
C  0.657292 -0.580844 0.381826
C  -0.807056 1.250137 0.493238
C  -1.92717 -0.878062 0.03315
C  -3.290944 -0.200594 0.298526
C  1.330968 0.591715 0.032474
C  -0.953066 -0.514556 2.353464
C  1.373332 -1.799455 0.374089
C  -1.938504 2.006811 0.489193
C  -3.232524 1.324697 0.636158
C  2.685154 0.655782 -0.376472
C  2.729567 -1.846492 -0.038277
C  3.368574 -0.63181 -0.412608
C  -4.220905 -0.419702 -0.943674
C  3.414062 1.867461 -0.765959
C  3.490817 -3.155601 -0.067744
C  -5.113827 -1.640518 -0.895025
C  2.773013 3.235195 -0.770889
H  -3.752451 -0.714092 1.165284
H  -0.17578 0.015722 2.929798
H  -1.938611 -0.160711 2.700567
H  -0.859113 -1.596081 2.546888
H  -1.932676 3.088892 0.337374
H  3.018009 -3.898538 -0.741549
H  4.510102 -2.978346 -0.442329
H  3.583532 -3.608791 0.939634
H  1.246318 -3.747511 0.69424
H  -4.493311 -2.542283 -0.733785
H  -5.817829 -1.562359 -0.044355
H  -5.67929 -1.741776 -1.833583
H  4.973125 0.298713 -1.024828
H  2.397134 3.50293 0.232292
H  1.897891 3.259233 -1.444318
H  3.518506 3.973876 -1.100961
