program: Gaussian 09
title: 000122720
version: EM64L-G09RevD.01
frameworkgroup: C1[X(C22H14O7)]
method: RPBEPBE
basis: SDD
operation: Freq
keyword: #pfreq=noraman
keyword: PBEPBE/SDD
title: #p freq=noraman PBEPBE/SDD
converged: YES YES NO NO
title: Mulliken charges:
elementType: O O O O O O O C C C C C C C C C C C C C C C C C C C C C C H H H H H H H H H H H H H H
charge: -0.183346 -0.248786 -0.148051 -0.396234 -0.179772 -0.305790 -0.387094 -0.238363 -0.238156 0.149752 0.054104 -0.012092 0.258269 0.040373 -0.633196 0.075472 0.388600 0.292930 -0.841759 -0.171387 0.308798 -0.473007 0.037548 0.137809 -0.540803 0.184392 0.513109 -0.573459 -0.804520 0.281424 0.273729 0.284092 0.286079 0.238424 0.231116 0.284548 0.390765 0.288450 0.271416 0.233911 0.241988 0.240392 0.388326
chargesum: 0.00000
title: Mulliken charges with hydrogens summed into heavy atoms:
elementType: O O O O O O O C C C C C C C C C C C C C C C C C C C C C C
charge: -0.183346 -0.248786 -0.148051 -0.005469 -0.179772 -0.305790 0.001233 0.043061 0.035573 0.149752 0.054104 -0.012092 0.258269 0.040373 -0.349104 0.075472 0.388600 0.292930 -0.086141 -0.171387 0.308798 -0.188459 0.037548 0.137809 -0.252353 0.184392 0.513109 -0.302043 -0.088230
polarizability: 4.66482451e+02 8.69037717e+00 2.64727931e+02 -1.09431089e+00 6.96300151e+00 1.72643235e+02
1716.lowfreq: -5.5094 -1.6004 -0.0009 -0.0008 -0.0007 2.6266 19.3963 28.1228 34.8590
frequency: 19.2288 28.1141 34.8516 52.8893 68.0925 87.6244 104.8212 113.6951 131.1723 137.4886 142.7513 157.5953 169.1291 198.0595 214.7158 230.7210 237.0562 241.3153 250.8597 273.5721 288.7585 314.3085 330.0749 344.3687 371.2011 375.1205 376.9304 385.4535 402.8839 415.8524 426.5113 458.3223 485.0633 521.7615 530.3467 540.0064 546.7460 564.0629 574.4368 589.9829 600.2352 626.8054 635.5165 656.0684 683.0696 703.1715 706.6218 719.6250 737.0423 769.1862 780.1052 793.4590 809.2701 833.8353 849.3878 879.2277 885.1859 901.6071 915.6316 922.9683 936.2420 940.9023 960.0301 979.5637 984.3134 1004.3948 1011.3861 1021.8964 1044.6828 1050.3597 1055.4670 1080.5639 1089.2271 1091.1928 1141.2450 1162.5920 1207.6814 1227.4965 1230.8934 1245.1943 1280.5929 1289.4175 1294.5887 1303.4373 1327.2475 1342.3217 1359.1883 1376.1085 1384.6341 1390.9769 1395.3169 1398.9866 1406.7213 1423.6815 1452.2217 1457.6120 1461.1414 1466.1976 1475.4763 1476.5820 1532.1695 1536.9635 1554.3709 1570.2787 1584.5332 1600.0974 1604.2013 1638.7038 1652.4728 2762.4183 2930.8806 2983.3112 2988.3303 3061.3884 3071.0584 3073.4416 3076.6182 3096.1108 3098.6905 3147.9501 3149.9695 3164.3429 3164.8767
redmass: 5.7852 8.6078 7.3444 1.0646 7.1000 6.0477 3.3499 8.1136 1.9696 3.3623 6.1710 3.9136 6.6759 5.7929 5.9069 4.6524 5.0305 5.5569 4.6238 4.4168 6.6141 4.4575 5.5452 7.6662 7.5410 6.6278 6.6654 6.6555 6.5586 6.3744 6.6244 8.2711 6.1890 5.1600 8.2943 6.9187 7.4015 4.5513 4.6947 4.6696 5.6478 6.3744 6.7113 3.7814 6.4560 6.1998 4.6792 5.1273 5.5849 6.9395 7.3195 7.3268 4.7801 5.6504 4.1366 1.1224 1.5393 6.8425 1.4915 1.5610 1.3667 1.1299 3.5127 2.5699 2.6704 2.7291 2.8816 1.8289 1.6279 1.5928 2.4861 4.0787 2.4082 1.9181 3.0373 1.7301 2.5331 1.5195 1.8857 2.2950 2.3140 3.4436 2.7319 1.3460 2.2572 4.8053 2.2267 6.3435 3.0008 4.0997 1.2256 1.4167 3.0615 7.3464 2.2544 4.5769 1.4081 1.0453 1.1696 1.1088 5.8366 4.9205 4.4391 4.2168 8.4912 3.8698 6.6489 6.1984 11.5391 1.0712 1.0709 1.0379 1.0370 1.0971 1.0869 1.0967 1.0849 1.1001 1.0991 1.0916 1.0918 1.0930 1.0927
irintensity: 0.3744 0.3871 0.0736 0.7683 0.4418 3.0916 1.9810 0.2767 1.0023 1.0295 1.4914 0.6617 1.0001 0.3051 1.0598 0.3271 2.4553 4.2619 2.1709 0.4262 4.6708 7.4625 4.3253 4.3807 6.7051 7.5493 18.4656 3.4465 6.3762 7.8434 2.8704 7.4472 13.1681 3.4274 1.5875 6.3608 22.9217 5.3400 3.1656 3.5935 3.1326 1.6920 9.2888 2.9565 2.4387 5.5091 4.1326 12.0503 25.1816 2.6975 7.7077 4.8991 23.4224 35.2269 67.4297 102.4212 43.0854 27.9412 19.5857 4.5197 15.7679 95.3728 7.1468 6.0315 9.1996 126.4040 36.3124 22.9666 21.0870 15.4351 26.2871 17.2618 27.7220 1.4781 18.6945 7.8736 258.1572 51.0681 1.6392 73.5872 192.1518 31.3258 278.6246 7.9226 130.5770 130.8250 10.9233 20.8779 109.0239 42.7574 25.8579 111.3885 26.1249 58.5238 7.6609 7.3014 104.5397 15.7628 100.3902 32.6820 87.3377 104.5809 27.3491 123.0272 0.8941 222.7131 91.5589 70.2726 247.0735 115.0840 237.7595 14.9622 6.3928 12.0701 10.3444 8.3574 5.6154 20.6567 19.0247 0.9745 1.0169 7.7689 1.9948
temp: 298.150 k
press: 1.00000 atm
elementType: 8 8 8 8 8 8 8 6 6 6 6 6 6 6 6 6 6 6 6 6 6 6 6 6 6 6 6 6 6 1 1 1 1 1 1 1 1 1 1 1 1 1 1
symmnumber: 1
zpe: 797998.4 jmol-1
zpe.correction: 0.303942 hartree
zpe.thermalcorrener: 0.328295 hartree
zpe.thermalcorrenthalpy: 0.329240 hartree
zpe.thermalcorrgfe: 0.249273 hartree
zpe.sumelectzpe: -1371.228798 hartree
zpe.sumelectthermal: -1371.204444 hartree
zpe.sumelectthermalent: -1371.203500 hartree
zpe.sumelectthermalfe: -1371.283466 hartree
dipole: -4.6343 3.0486 -0.8601
dipole: 5.6134
quadrupole: -184.2211 -178.3513 -163.0317
quadrupole: -18.8151 -14.5952 0.6142
quadrupole: -9.0197 -3.1499 12.1697 -18.8151 -14.5952 0.6142
hfenergy: -1371.5327395 hartree
pointgroup: C01 [X(C22H14O7)]
dipole: 1.8238145 -0.4646211 1.1555047 debye
polarizability: 466.4242234|7.2410482|172.6010139|-7.0504687|-5.5600156|264.8283795 unknown
InChI: InChI=1S/C22H14O7/c1-7-3-9-15(12(23)4-7)13(24)6-11(17(9)25)14-8(2)5-10-16(19(14)27)20(28)22-21(29-22)18(10)26/h3-6,21-23,27H,1-2H3
charge 0 multiplicity 1
43 atoms
O  -6.672021 0.83503 -0.798037
O  -3.517076 1.72242 -2.341311
O  -5.521283 -1.063512 2.037031
O  -1.113559 0.909351 -1.803204
O  1.1705 0.655322 1.953692
O  3.129098 -1.123336 -2.862531
O  5.514105 -0.480142 -2.193082
C  -5.226885 1.195482 -0.54451
C  -5.685197 -0.219188 -0.347273
C  -3.910449 1.125694 -1.285638
C  -5.04089 -0.679278 0.949484
C  -3.03516 0.238842 -0.458401
C  -3.536386 -0.552638 0.651803
C  -1.627424 0.222157 -0.727968
C  -2.632064 -1.267267 1.44872
C  -0.71562 -0.488625 0.118016
C  -1.226344 -1.234697 1.21497
C  0.744454 -0.401743 -0.17745
C  -0.320412 -2.033262 2.127394
C  1.649151 0.210119 0.861642
C  3.109597 0.300086 0.549799
C  1.258766 -0.796835 -1.389705
C  3.600315 -0.154703 -0.712072
C  2.692453 -0.706527 -1.710379
C  3.997019 0.834819 1.499047
C  5.001653 -0.057673 -0.994607
C  5.396255 0.933306 1.221938
C  5.884031 0.48579 -0.021144
C  6.332126 1.514608 2.262515
H  -5.153834 1.816403 0.362138
H  -5.474657 -0.906195 -1.181281
H  -3.030825 -1.86793 2.273095
H  0.111381 -1.371672 2.90057
H  -0.879027 -2.837434 2.634129
H  0.524057 -2.487091 1.579706
H  0.616321 -1.201364 -2.178056
H  -1.883068 1.364277 -2.305641
H  3.592342 1.179423 2.456738
H  6.948381 0.546902 -0.26766
H  7.374724 1.542676 1.906165
H  6.033351 2.545053 2.530725
H  6.304808 0.919782 3.194639
H  4.722095 -0.835934 -2.759104
