program: Gaussian 09
title: 000122652
version: EM64L-G09RevD.01
frameworkgroup: C1[X(C9H13FN5O4P)]
method: RPBEPBE
basis: SDD
operation: Freq
keyword: #p
keyword: freq=noraman
keyword: PBEPBE/SDD
title: #p freq=noraman PBEPBE/SDD
converged: YES YES NO NO
title: Mulliken charges:
elementType: P F O O O O N N N N N C C C C C C C C C H H H H H H H H H H H H H
charge: 1.213055 -0.237502 -0.251472 -0.722990 -0.685949 -0.656705 -0.150317 -0.079678 -0.284249 -0.050955 -0.599059 -0.017953 -0.473953 0.291768 -0.235069 -0.101100 -0.209392 -0.564270 0.173432 -0.261757 0.259508 0.303659 0.274911 0.234324 0.210235 0.288147 0.250642 0.286693 0.260640 0.353106 0.343387 0.451982 0.386884
chargesum: 0.00000
title: Mulliken charges with hydrogens summed into heavy atoms:
elementType: P F O O O O N N N N N C C C C C C C C C
charge: 1.213055 -0.237502 -0.251472 -0.271008 -0.299065 -0.656705 -0.150317 -0.079678 -0.284249 -0.050955 0.097433 0.241555 0.104616 0.291768 0.209490 -0.101100 0.078755 -0.026935 0.173432 -0.001117
polarizability: 2.17805661e+02 -2.63709332e+00 1.85634396e+02 1.73509708e+01 -3.19860629e+00 1.04515086e+02
1716.lowfreq: -7.1887 -0.0016 -0.0012 -0.0010 1.7178 6.8270 24.5142 45.3373 47.3533
frequency: 23.8096 45.2987 47.3199 53.8692 78.3074 95.8892 130.1046 136.0546 152.3154 158.9807 173.8702 205.8300 212.4076 251.3684 254.8568 263.8966 304.4870 307.1838 321.9223 337.1349 344.0495 368.2995 422.5280 451.0982 529.7591 530.2040 551.8789 560.6281 568.6921 581.4740 616.8915 640.0726 650.2532 670.2876 692.4229 710.8880 744.8344 789.9041 794.1771 827.4869 837.8018 868.6399 892.4661 894.7527 916.3234 929.4182 964.8613 986.7320 1013.8726 1024.7525 1031.5816 1041.1411 1064.0008 1109.6918 1133.1276 1172.5055 1196.7803 1207.2084 1222.1815 1238.9920 1264.3597 1296.8646 1305.3204 1328.8437 1338.6167 1344.9562 1351.4645 1367.1683 1377.2225 1379.1506 1389.3442 1403.6740 1424.5825 1433.7756 1449.2777 1467.3131 1491.5183 1547.3350 1585.4791 1637.7229 1727.7094 2948.1853 2995.5073 3018.6026 3051.7882 3097.4112 3122.1150 3127.1190 3183.2102 3233.7703 3532.9621 3600.9354 3686.2504
redmass: 7.0329 7.9838 6.5831 5.8543 7.4176 5.2322 6.2508 6.4516 5.0448 1.8689 7.3904 5.9779 5.5239 3.8664 2.0317 4.1437 6.7519 4.0809 4.6816 3.6796 3.4719 7.9064 3.4451 7.9320 3.6989 9.0223 2.5481 1.2543 1.2867 4.4544 4.4547 4.9739 4.3190 8.3346 7.0910 6.6311 6.4710 4.5270 3.9513 11.3351 1.5140 3.7861 1.7777 8.3271 2.6652 1.4409 2.3733 1.8475 2.5374 3.8507 2.7162 4.1954 3.5129 2.6124 2.1632 2.0110 1.5206 1.2305 1.1722 2.3182 1.8447 2.0866 1.2204 2.6995 1.3397 1.5594 1.9217 1.1498 1.4182 1.6692 1.2666 6.7694 1.0813 2.5666 1.0956 1.5995 2.1459 5.0401 1.7910 2.7497 1.2865 1.0856 1.0640 1.0586 1.0597 1.1087 1.1064 1.0991 1.0935 1.0994 1.0447 1.0661 1.1057
irintensity: 1.7539 2.5927 1.0596 2.1688 2.5610 5.3253 4.6346 1.9017 12.1138 40.5776 24.5806 9.6645 9.9556 11.4180 38.1655 15.4125 15.5652 19.6675 20.9476 174.2027 23.7942 12.1927 16.0525 25.4538 1.8604 33.9514 47.1995 93.9516 109.4261 14.0904 1.7469 37.6708 58.2274 18.7291 216.4180 79.7091 60.4701 9.7798 8.1899 178.6959 11.5870 2.7371 20.9928 8.2781 64.3601 10.8997 1.2246 87.6706 1.7965 25.0476 84.0888 56.8772 28.9010 4.5548 3.4408 178.3005 52.4696 0.8509 7.2028 81.6860 80.7449 9.3215 28.6059 46.4798 34.7868 51.6429 69.7584 35.8682 57.7650 272.2541 3.3959 26.9772 7.7272 3.9147 13.6323 113.2346 18.6380 625.5012 31.9937 1343.8933 2748.6888 10.3244 33.9196 26.5360 5.5682 22.8433 1.1604 2.0708 4.0214 1.4205 159.0549 46.3961 57.5761
temp: 298.150 k
press: 1.00000 atm
elementType: 15 9 8 8 8 8 7 7 7 7 7 6 6 6 6 6 6 6 6 6 1 1 1 1 1 1 1 1 1 1 1 1 1
symmnumber: 1
zpe: 627184.9 jmol-1
zpe.correction: 0.238882 hartree
zpe.thermalcorrener: 0.258325 hartree
zpe.thermalcorrenthalpy: 0.259269 hartree
zpe.thermalcorrgfe: 0.189952 hartree
zpe.sumelectzpe: -1364.977776 hartree
zpe.sumelectthermal: -1364.958334 hartree
zpe.sumelectthermalent: -1364.957390 hartree
zpe.sumelectthermalfe: -1365.026706 hartree
dipole: 4.2896 0.8201 0.6028
dipole: 4.4087
quadrupole: -107.1104 -126.7886 -130.3234
quadrupole: -2.1781 0.0491 4.6048
quadrupole: 14.2970 -5.3812 -8.9159 -2.1781 0.0491 4.6048
hfenergy: -1365.2166584 hartree
pointgroup: C01 [X(C9H13F1N5O4P1)]
dipole: 1.6860223 -0.266863 -0.3076294 debye
polarizability: 216.4500106|4.4710318|185.9251416|-20.6296996|1.0658285|105.5799899 unknown
InChI: InChI=1S/C9H13FN5O4P/c10-1-6(19-5-20(16,17)18)2-15-4-14-7-8(11)12-3-13-9(7)15/h3-4,6,16-17H,1-2,5,11H2
charge 0 multiplicity 1
33 atoms
P  -2.909866 1.387685 -0.109845
F  -1.483747 -3.969918 -0.436189
O  -3.00449 -1.404027 0.380365
O  -1.781005 1.413038 1.138966
O  -4.227269 2.3988 0.399263
O  -2.306145 1.709721 -1.563016
N  0.706199 -1.272561 0.426361
N  2.867783 -1.549313 -0.310039
N  0.668768 1.223563 0.529389
N  2.788265 2.227343 -0.138314
N  4.65035 0.9409 -0.801968
C  -1.695422 -1.52303 -0.294909
C  -0.663631 -1.594558 0.863838
C  1.244266 0.005468 0.291387
C  -1.659928 -2.742279 -1.218106
C  2.576555 -0.181456 -0.160469
C  1.72667 -2.165725 0.048514
C  -3.83485 -0.274776 -0.015255
C  3.358233 0.992322 -0.373443
C  1.502055 2.282959 0.286888
H  -1.49871 -0.629232 -0.926814
H  -0.976138 -0.862957 1.625636
H  -0.670673 -2.602904 1.30635
H  -2.609269 -2.844448 -1.770902
H  -0.803192 -2.690637 -1.915266
H  1.57051 -3.242732 0.063665
H  -4.289804 -0.41664 -1.015092
H  -4.617485 -0.193369 0.752584
H  1.078942 3.276999 0.450999
H  5.09073 0.040435 -0.982888
H  5.160803 1.81126 -0.941883
H  -0.697699 1.395032 0.867759
H  -4.079906 3.36924 0.267833
