program: Gaussian 09
title: 000122693
version: EM64L-G09RevD.01
frameworkgroup: C1[X(C21H26Cl2N2O)]
method: RPBEPBE
basis: SDD
operation: Freq
keyword: #p
keyword: freq=noraman
keyword: PBEPBE/SDD
title: #p freq=noraman PBEPBE/SDD
converged: YES YES NO NO
title: Mulliken charges:
elementType: Cl Cl O N N C C C C C C C C C C C C C C C C C C C C C H H H H H H H H H H H H H H H H H H H H H H H H H H
charge: -0.050827 -0.036360 -0.299751 -0.112380 -0.131499 -0.119122 -0.466020 0.573054 -0.330626 -0.561671 0.510023 -0.378944 -0.453841 -0.352639 -0.351709 -0.199940 -0.130754 -0.838422 -0.289966 -0.206242 -0.227278 -0.109049 -0.331608 0.384940 -0.804865 -0.826022 0.233190 0.247000 0.254201 0.205422 0.201057 0.208410 0.211575 0.224997 0.213710 0.204386 0.284925 0.259641 0.295787 0.214068 0.278129 0.217919 0.203616 0.283183 0.261799 0.251648 0.215259 0.218861 0.240458 0.295179 0.208156 0.208939
chargesum: 0.00000
title: Mulliken charges with hydrogens summed into heavy atoms:
elementType: Cl Cl O N N C C C C C C C C C C C C C C C C C C C C C
charge: -0.050827 -0.036360 -0.299751 -0.112380 -0.131499 0.114068 0.035181 0.573054 0.075854 -0.141686 0.510023 -0.153947 -0.035745 -0.352639 -0.066783 0.059701 0.165033 -0.128306 -0.086350 0.076942 0.034520 -0.109049 -0.079960 0.384940 -0.130288 -0.113748
polarizability: 3.42908129e+02 1.98221726e+01 2.63060675e+02 -1.45741458e+01 -2.33303322e+01 1.87123178e+02
1716.lowfreq: -7.9217 -5.7885 0.0006 0.0011 0.0021 3.3109 13.0963 22.1636 22.2887
frequency: 12.6496 22.1387 22.2506 25.7929 35.8501 43.3729 49.3135 57.3535 58.9506 81.1134 84.9904 106.8705 131.7554 141.8193 147.9836 165.8738 169.1611 180.1412 183.7405 198.4229 226.6650 235.0422 254.8820 294.0378 301.9552 304.8725 315.4078 335.6676 348.8368 366.7253 382.8732 402.6544 414.5032 419.8859 447.6740 466.4072 482.1632 495.1883 524.4582 547.5766 555.1794 577.1923 620.9591 644.9209 654.9891 682.8101 710.1213 725.2505 739.8940 757.6520 782.5844 793.4642 794.2958 823.1317 833.5888 840.0591 855.6628 863.5220 865.8213 883.8671 901.8038 916.2586 939.5042 954.4679 964.6720 981.8218 995.7317 1003.1699 1005.0390 1008.4746 1014.0044 1033.0946 1034.0402 1049.6826 1052.5257 1062.8410 1079.9857 1091.4438 1103.8713 1111.6561 1125.5640 1130.2439 1164.4258 1179.6813 1185.8562 1200.3773 1207.7082 1215.9187 1233.0913 1239.7401 1242.5354 1269.2336 1273.4088 1302.9251 1310.2382 1330.8513 1331.2919 1340.8337 1350.0546 1362.5504 1365.2919 1371.7111 1378.7498 1386.7096 1390.3566 1396.1707 1408.7681 1437.9051 1449.7396 1453.1379 1456.2343 1458.8513 1459.9711 1465.8423 1468.7860 1476.1149 1481.1094 1483.4660 1489.6702 1491.3651 1566.7648 1591.6474 1675.3950 1692.0094 2947.9882 2949.3766 2958.3064 2958.8042 2965.0345 2968.5270 2974.6228 3013.7291 3021.0706 3021.6262 3024.7849 3032.4609 3048.7996 3050.0991 3065.5242 3074.9232 3082.5766 3088.9534 3091.0779 3103.9041 3148.2992 3175.9250 3183.0238 3222.3320 3245.9463 3254.6132
redmass: 5.0436 4.6075 7.7952 4.5662 5.8266 4.0609 4.1715 4.5850 3.5595 3.6089 3.2551 6.7583 5.2963 1.4739 2.5715 5.1203 2.9810 1.9311 3.8186 1.5419 1.5284 5.0114 3.1112 2.3294 3.8484 4.2896 2.7306 2.6725 3.0151 9.1890 2.6067 2.9776 4.0955 3.0961 3.5832 2.3973 3.6224 2.6487 3.5440 2.3128 3.9302 3.2749 3.2718 6.8108 3.6860 5.6150 4.6703 1.2415 2.4600 5.2448 2.5557 1.5229 1.8201 1.4475 1.6504 1.4022 2.3378 2.3519 1.4137 6.1698 1.8663 1.7942 4.3546 1.3902 1.6420 1.3506 1.9830 1.2978 2.7997 2.4957 3.6825 1.6394 3.2817 2.1552 1.8051 2.3448 2.4292 1.6489 1.7106 1.7548 2.2912 1.4786 1.6858 1.7937 1.3020 1.2290 1.8830 1.5954 2.0140 1.5801 1.5129 1.9401 1.3008 1.3373 1.3746 2.2429 2.6369 1.4425 1.5801 1.5437 1.9406 1.7728 5.1453 1.5664 1.2589 1.3030 1.2246 1.8321 2.6251 1.0882 1.0488 1.1045 1.7817 1.0903 1.0630 1.0670 1.0713 2.4058 1.0860 1.0767 8.1594 7.5108 6.6863 6.3099 1.0622 1.0404 1.0561 1.0373 1.0675 1.0825 1.0387 1.1054 1.0612 1.0963 1.0969 1.0963 1.0921 1.0955 1.0925 1.0973 1.0955 1.0963 1.1032 1.0905 1.0891 1.0958 1.0938 1.0908 1.1002 1.1082
irintensity: 0.1443 0.1153 0.1230 0.5415 0.5735 0.7201 0.3311 1.4792 0.8417 1.3882 3.3202 0.3677 1.2246 1.1511 0.5026 0.1568 1.1678 1.6975 1.0995 4.0801 2.9664 0.7297 2.0341 0.3972 1.1452 1.3304 2.1985 1.4599 1.9078 6.4173 0.3691 3.1379 6.8777 9.7758 11.1443 9.1117 10.5316 2.9039 2.6186 6.4225 12.1970 15.3394 11.1900 0.2744 20.0344 5.0354 9.0485 42.1837 5.8106 49.4069 2.3624 45.8936 10.6732 21.1612 36.1350 1.2253 4.8774 26.7556 14.4889 9.6837 13.0301 10.2651 127.7080 0.2355 7.7899 3.9137 4.1816 4.2709 9.7152 7.5100 111.1390 8.4426 45.6419 25.1316 9.2787 19.7257 18.9815 9.6879 21.0372 4.4265 4.5292 11.6382 1.8933 7.5655 2.6965 7.5582 8.0785 39.6813 3.9047 5.2793 3.3855 26.5816 3.9047 22.4941 0.1927 2.0244 1.4755 16.8939 14.1553 3.8362 1.5853 13.5166 7.5140 0.1597 19.8257 17.2317 23.0697 57.5464 73.1001 11.4566 3.4112 21.7394 9.9651 17.4286 7.7865 9.3521 10.9826 25.4117 4.8441 18.5027 30.3005 47.7059 44.3975 5.1833 15.0820 46.9130 64.9824 30.0934 95.7170 11.8429 23.1724 29.9787 21.3191 13.3667 13.7163 34.9177 14.0044 14.6430 18.4991 53.5175 41.3499 27.4776 6.8722 29.2447 0.1964 1.6883 0.7445 3.4610 0.9112 6.5638
temp: 298.150 k
press: 1.00000 atm
elementType: 17 17 8 7 7 6 6 6 6 6 6 6 6 6 6 6 6 6 6 6 6 6 6 6 6 6 1 1 1 1 1 1 1 1 1 1 1 1 1 1 1 1 1 1 1 1 1 1 1 1 1 1
symmnumber: 1
zpe: 1105114.4 jmol-1
zpe.correction: 0.420916 hartree
zpe.thermalcorrener: 0.448715 hartree
zpe.thermalcorrenthalpy: 0.449659 hartree
zpe.thermalcorrgfe: 0.357957 hartree
zpe.sumelectzpe: -1918.685190 hartree
zpe.sumelectthermal: -1918.657391 hartree
zpe.sumelectthermalent: -1918.656447 hartree
zpe.sumelectthermalfe: -1918.748149 hartree
dipole: -1.9822 -1.2810 -0.3392
dipole: 2.3844
quadrupole: -184.8738 -165.5654 -167.7875
quadrupole: -9.9341 -4.4104 -1.4088
quadrupole: -12.1316 7.1769 4.9547 -9.9341 -4.4104 -1.4088
hfenergy: -1919.1061059 hartree
pointgroup: C01 [X(C21H26Cl2N2O1)]
dipole: 0.8090637 0.4736989 0.0322808 debye
polarizability: 343.1700549|8.049118|243.263947|25.3005363|38.9928108|206.6579799 unknown
InChI: InChI=1S/C21H26Cl2N2O/c1-16(2)5-4-6-17(3)9-12-26-21(14-25-11-10-24-15-25)19-8-7-18(22)13-20(19)23/h5,7-11,13,15,21H,4,6,12,14H2,1-3H3
charge 0 multiplicity 1
52 atoms
Cl 3.831466 -1.846872 -1.990378
Cl 7.193955 0.874281 1.477901
O  0.492651 0.465985 0.096685
N  -0.269664 -2.360391 -0.217661
N  -2.481322 -2.491613 -0.701949
C  1.45818 -0.542321 -0.340111
C  0.998927 -1.863002 0.330572
C  2.886312 -0.188335 0.078496
C  0.409478 1.660233 -0.806262
C  -3.124104 3.337481 -0.35642
C  -2.024205 2.43938 -0.910739
C  -0.768299 2.48551 -0.373023
C  -4.427536 2.585154 0.061832
C  4.030818 -0.708977 -0.565973
C  3.106308 0.671602 1.184662
C  -0.433034 -3.476639 -1.055449
C  -1.532208 -1.79805 -0.036097
C  -2.431888 1.536504 -2.059135
C  -4.208849 1.579497 1.174824
C  5.345877 -0.403055 -0.166495
C  4.405369 1.002831 1.622933
C  5.507749 0.458366 0.935813
C  -1.797964 -3.542072 -1.33977
C  -4.590491 0.268671 1.210044
C  -4.295889 -0.59194 2.430156
C  -5.309078 -0.465917 0.091282
H  1.412749 -0.672562 -1.442409
H  1.77134 -2.637585 0.191427
H  0.887706 -1.673194 1.413663
H  1.357081 2.231306 -0.723285
H  0.307987 1.299666 -1.849352
H  -3.401319 4.08567 -1.130099
H  -2.737737 3.90316 0.513535
H  -0.593769 3.151288 0.48341
H  -4.879264 2.103869 -0.823736
H  -5.153278 3.356836 0.396488
H  2.225416 1.086238 1.686343
H  0.40451 -4.102676 -1.352453
H  -1.688448 -0.892688 0.543985
H  -1.573823 1.105077 -2.600214
H  -3.035821 0.688233 -1.68394
H  -3.058153 2.086356 -2.787381
H  -3.681249 1.980186 2.056123
H  6.207777 -0.819673 -0.692985
H  4.557859 1.668589 2.476583
H  -2.326799 -4.269655 -1.9508
H  -5.235751 -0.94622 2.899237
H  -3.717887 -0.042418 3.194306
H  -3.728953 -1.499009 2.142108
H  -4.668974 -1.285532 -0.294209
H  -5.584643 0.187455 -0.753541
H  -6.239716 -0.931828 0.472559
