program: Gaussian 09
title: 000122890
version: EM64L-G09RevD.01
frameworkgroup: C1[X(C32H20N2O6)]
method: RPBEPBE
basis: SDD
operation: Freq
keyword: #p
keyword: freq=noraman
keyword: PBEPBE/SDD
title: #p freq=noraman PBEPBE/SDD
converged: YES YES NO NO
title: Mulliken charges:
elementType: O O O O O O N N C C C C C C C C C C C C C C C C C C C C C C C C C C C C C C C C H H H H H H H H H H H H H H H H H H H H
charge: -0.191456 -0.191427 -0.191175 -0.191179 -0.241634 -0.241636 -0.439740 -0.439678 0.002487 0.002532 0.171891 0.171965 0.259750 0.259772 0.383387 0.383399 -0.212095 -0.212276 0.316998 0.317014 0.270983 0.270988 -0.275879 -0.275912 -0.440202 -0.440210 -0.385475 -0.385487 -0.392068 -0.392067 -0.375239 -0.375247 -0.231588 -0.231586 -0.229113 -0.229115 0.213084 0.213069 -0.784124 -0.784147 0.294268 0.294268 0.321188 0.321194 0.332180 0.332192 0.293746 0.293748 0.293879 0.293879 0.242147 0.242147 0.242176 0.242176 0.226007 0.263594 0.262019 0.226003 0.263602 0.262021
chargesum: 0.00000
title: Mulliken charges with hydrogens summed into heavy atoms:
elementType: O O O O O O N N C C C C C C C C C C C C C C C C C C C C C C C C C C C C C C C C
charge: -0.191456 -0.191427 -0.191175 -0.191179 -0.241634 -0.241636 -0.107560 -0.107486 0.002487 0.002532 0.171891 0.171965 0.259750 0.259772 0.383387 0.383399 -0.212095 -0.212276 0.316998 0.317014 0.270983 0.270988 -0.275879 -0.275912 -0.145934 -0.145941 -0.064287 -0.064292 -0.098323 -0.098320 -0.081360 -0.081368 0.010559 0.010561 0.013063 0.013062 0.213084 0.213069 -0.032504 -0.032522
polarizability: 5.42248467e+02 -1.17145355e-02 4.15745552e+02 1.66610152e+01 -3.40910896e-03 3.65147317e+02
1716.lowfreq: -4.3328 -0.0004 0.0005 0.0009 4.4830 7.6649 12.9915 25.8291 27.3299
frequency: 12.9097 25.8148 27.3239 27.6822 32.0763 38.6767 40.5662 57.6595 60.2586 61.1045 68.2535 80.1945 92.5881 93.8089 113.4529 122.4826 122.6170 153.6076 155.3799 176.1903 176.2088 198.5256 212.5851 213.3753 245.4628 246.1026 273.7161 274.1375 289.8614 294.3662 347.5962 349.4485 371.7088 374.9481 388.7022 405.1192 406.5624 406.7310 416.8190 430.1969 439.9104 448.6933 450.2368 451.1482 470.3271 473.3203 526.4543 532.0807 547.0994 551.3199 568.1662 571.8454 598.4407 599.1655 627.3209 643.3427 655.7324 657.3452 673.1703 673.8557 675.0735 690.0219 690.2275 706.4225 714.9327 728.6882 730.4524 756.4426 761.4941 764.6535 768.5419 800.8946 809.4631 809.5169 848.2511 861.8285 862.4639 868.9563 902.7809 903.0754 914.4853 916.5471 921.4622 943.4120 943.4535 981.1040 989.0598 992.4340 998.6820 998.7534 1016.2705 1016.3247 1021.0652 1024.3161 1024.3487 1025.7352 1040.0485 1040.8914 1045.7660 1045.8633 1087.1179 1089.0058 1103.4140 1164.4660 1165.0135 1170.2404 1170.4009 1191.1843 1192.0000 1203.8617 1214.3428 1220.9765 1239.2951 1253.2884 1277.0848 1284.6768 1301.5035 1302.6147 1304.9498 1320.4829 1350.1394 1359.8778 1390.7012 1391.9114 1394.6149 1400.1550 1401.6761 1420.2940 1437.0232 1439.3753 1442.7396 1443.9489 1449.9300 1450.3279 1470.0509 1470.3911 1470.6864 1470.8589 1494.8853 1506.3772 1528.2729 1532.8563 1538.4428 1539.1625 1571.9843 1574.3057 1584.1244 1585.7964 1599.7872 1601.3235 1611.9270 1612.6168 1630.8964 1632.0198 2999.1234 2999.1662 3093.8819 3094.0457 3111.0567 3111.2721 3138.3642 3138.3682 3152.8930 3152.9081 3160.8184 3160.8388 3163.3835 3163.3880 3172.8470 3172.9234 3192.8852 3192.9210 3485.9537 3487.4271
redmass: 6.4131 7.2079 3.8729 3.8855 6.3944 1.3603 1.3322 7.0657 4.7707 3.1645 4.8650 5.7520 5.7100 5.7306 5.4442 5.0534 4.9993 5.3947 5.9845 5.2452 5.6571 7.0432 7.5718 7.6451 5.4489 5.1103 5.8248 5.8467 6.6757 8.0032 6.0969 5.7898 9.0254 9.9683 5.8935 6.1308 6.8670 4.3014 3.6390 4.4125 5.5733 5.0432 4.8043 4.7151 8.6578 10.1508 4.4433 4.7476 4.7247 4.9487 5.0808 5.4544 3.2847 3.3504 7.4377 6.8128 5.0981 5.5701 4.3142 6.9997 4.6261 2.4061 3.6190 2.3470 1.3878 2.4287 2.3273 6.6252 6.1520 4.8461 6.5157 6.2491 1.7962 1.8011 5.4317 2.5050 2.4651 5.9851 1.4462 1.4472 6.4783 6.1617 6.9810 2.0912 2.1053 4.6054 2.0675 2.1306 1.3946 1.3942 1.3655 1.3639 2.6801 1.3658 1.3730 2.6636 1.6557 1.6603 2.1639 2.1733 2.7892 2.2656 2.6003 1.6845 1.5369 1.1139 1.1168 2.4009 2.3282 2.0590 2.8610 2.3337 1.8678 2.0130 1.9961 2.5599 2.9008 3.1437 3.1595 5.3634 5.8310 6.7350 1.6158 1.2291 2.9774 9.0809 9.6445 7.0272 2.9473 2.7056 2.5531 2.2564 1.0953 1.2031 2.1624 1.4015 1.8005 1.2241 2.4235 2.8057 9.4999 8.3781 8.4224 6.4922 6.4368 6.0934 6.7799 6.8589 8.0482 7.8242 7.0443 7.0962 4.8018 4.7267 1.0365 1.0365 1.0986 1.0986 1.0999 1.0999 1.0863 1.0863 1.0902 1.0901 1.0909 1.0909 1.0947 1.0947 1.1004 1.1004 1.0954 1.0953 1.0761 1.0763
irintensity: 0.3131 0.0287 1.4601 1.9542 0.5030 0.0609 1.0037 9.8059 6.6764 0.3847 0.4959 2.2067 1.9896 2.5754 5.0550 0.5863 0.1545 0.3728 0.9104 0.5489 0.0930 1.8295 0.5576 2.8651 1.0889 1.7304 1.5436 0.6982 4.2504 0.7789 0.5859 2.8988 42.0600 19.6515 0.6926 12.2967 17.6814 1.1023 8.2452 0.0149 4.2832 0.9885 0.4473 2.4949 5.5692 0.9194 11.6225 18.1553 0.1128 0.9624 2.4466 0.0627 0.6941 0.2759 17.2038 3.3825 0.2281 0.9620 7.0400 0.7992 0.7250 9.6337 12.5372 2.1970 22.8165 61.0014 80.4847 0.0098 15.2882 0.7497 1.2784 7.1563 19.4556 26.6984 6.4395 7.9166 10.0178 0.4248 21.1615 37.4656 1.8856 1.3112 45.2779 2.7235 4.1621 106.7244 75.4257 8.9176 3.1705 4.2798 0.0620 0.1493 12.5180 1.8454 0.6819 0.6729 16.0450 2.8389 4.7437 2.1787 4.3334 0.2197 27.3011 11.9825 32.3841 22.6706 21.2329 6.4592 4.7744 61.0701 182.7539 119.4507 27.3794 0.1179 35.5276 68.7537 177.4127 460.4817 458.6601 627.3307 461.7541 252.7652 73.1593 45.5618 17.5473 5.7793 10.9917 0.2384 35.7063 1.0981 43.5577 50.4171 11.3710 7.0675 23.3945 45.1187 12.9785 0.5898 466.2738 374.0804 7.3623 91.4294 564.6505 120.1160 92.1808 20.2639 68.6783 85.8257 15.5545 0.0781 15.9207 12.6666 32.1707 140.3555 3.2253 6.8885 10.1916 7.4125 10.7272 10.6944 3.3092 3.6381 6.2555 5.2615 4.0905 4.2178 1.8544 0.5077 35.2947 29.9202 8.7221 9.3152 12.5439 90.7812
temp: 298.150 k
press: 1.00000 atm
elementType: 8 8 8 8 8 8 7 7 6 6 6 6 6 6 6 6 6 6 6 6 6 6 6 6 6 6 6 6 6 6 6 6 6 6 6 6 6 6 6 6 1 1 1 1 1 1 1 1 1 1 1 1 1 1 1 1 1 1 1 1
symmnumber: 1
zpe: 1154383.6 jmol-1
zpe.correction: 0.439681 hartree
zpe.thermalcorrener: 0.473150 hartree
zpe.thermalcorrenthalpy: 0.474094 hartree
zpe.thermalcorrgfe: 0.371031 hartree
zpe.sumelectzpe: -1789.639782 hartree
zpe.sumelectthermal: -1789.606313 hartree
zpe.sumelectthermalent: -1789.605369 hartree
zpe.sumelectthermalfe: -1789.708432 hartree
dipole: 0.0009 -2.1553 -0.0008
dipole: 2.1553
quadrupole: -210.5778 -210.3686 -253.8634
quadrupole: 0.0035 -30.3581 0.0035
quadrupole: 14.3588 14.5680 -28.9268 0.0035 -30.3581 0.0035
hfenergy: -1790.0794631 hartree
pointgroup: C01 [X(C32H20N2O6)]
dipole: -0.0002739 0.8479788 -0.0002405 debye
polarizability: 542.5477538|-0.0207665|415.7455532|-14.9831712|0.0093238|364.8480288 unknown
InChI: InChI=1S/C32H20N2O6/c1-15(35)33-23-13-11-21-25(31(39)19-9-5-3-7-17(19)29(21)37)27(23)28-24(34-16(2)36)14-12-22-26(28)32(40)20-10-6-4-8-18(20)30(22)38/h3-14,33-34H,1-2H3
charge 0 multiplicity 1
60 atoms
O  -1.027175 1.054157 -1.622067
O  1.026986 1.054525 1.62187
O  -4.87238 0.584558 2.302765
O  4.873028 0.583601 -2.301994
O  0.400337 -3.865945 3.560636
O  -0.400837 -3.865086 -3.561187
N  0.777699 -2.50376 1.679436
N  -0.777777 -2.503559 -1.679439
C  -0.538939 -0.808449 0.528037
C  0.539031 -0.808479 -0.527894
C  -1.718402 -0.013454 0.438627
C  1.718625 -0.013697 -0.438364
C  -2.730337 -0.117503 1.445135
C  2.73057 -0.117798 -1.444853
C  -0.402966 -1.728836 1.62386
C  0.40298 -1.728791 -1.623769
C  -1.890494 0.954623 -0.690827
C  1.890952 0.954049 0.691333
C  -3.117392 1.809718 -0.70718
C  3.117716 1.809341 0.707522
C  -4.119296 1.692637 0.297911
C  4.119653 1.692191 -0.297529
C  -3.970941 0.70949 1.411289
C  3.971108 0.709303 -1.411112
C  -2.563143 -1.027794 2.51408
C  2.563329 -1.028058 -2.513818
C  -1.420522 -1.833261 2.610603
C  1.420597 -1.833355 -2.610436
C  -3.281961 2.750664 -1.75428
C  3.282265 2.750329 1.754586
C  -5.271485 2.514083 0.243855
C  5.271922 2.513518 -0.243392
C  -4.429323 3.567134 -1.800549
C  4.429693 3.566704 1.800916
C  -5.427178 3.448474 -0.799221
C  5.427615 3.447928 0.799668
C  1.141385 -3.494263 2.606595
C  -1.141579 -3.493924 -2.606714
C  2.52716 -4.087541 2.377659
C  -2.52822 -4.085643 -2.378938
H  -3.355085 -1.084755 3.267056
H  3.355278 -1.085062 -3.266785
H  -1.286559 -2.540088 3.430962
H  1.286603 -2.54016 -3.430809
H  1.463049 -2.297709 0.945883
H  -1.463199 -2.297385 -0.945985
H  -2.4982 2.820924 -2.514761
H  2.498494 2.820619 2.515053
H  -6.024498 2.399602 1.029826
H  6.024946 2.399007 -1.029348
H  -4.551112 4.294219 -2.610363
H  4.551494 4.293786 2.610731
H  -6.31832 4.083904 -0.837639
H  6.318796 4.0833 0.838121
H  2.986139 -3.795663 1.417699
H  2.45617 -5.186753 2.422672
H  3.194514 -3.76939 3.198386
H  -2.985653 -3.796899 -1.41729
H  -2.459235 -5.184752 -2.428655
H  -3.195922 -3.762775 -3.197572
