program: Gaussian 09
title: 000122739
version: EM64L-G09RevD.01
frameworkgroup: C1[X(C22H28O7)]
method: RPBEPBE
basis: SDD
operation: Freq
keyword: #pfreq=noraman
keyword: PBEPBE/SDD
title: #p freq=noraman PBEPBE/SDD
converged: YES YES NO NO
title: Mulliken charges:
elementType: O O O O O O O C C C C C C C C C C C C C C C C C C C C C C H H H H H H H H H H H H H H H H H H H H H H H H H H H H
charge: -0.196558 -0.469945 -0.138160 -0.203092 -0.267506 -0.167123 -0.251532 0.329366 -0.238482 0.039692 -0.262592 -0.099566 -0.596576 -0.523253 0.332641 -0.281067 -0.469749 -0.513588 -0.096211 -0.461808 -0.482543 0.139328 0.564027 -0.400504 -0.744500 -0.206251 -0.761327 0.318823 -0.756930 0.290384 0.323404 0.215387 0.280832 0.268653 0.195144 0.253282 0.255099 0.288448 0.222957 0.217134 0.231491 0.208091 0.210488 0.216163 0.206381 0.255697 0.230306 0.220329 0.270412 0.198080 0.196725 0.345498 0.237252 0.266811 0.242121 0.283349 0.235073
chargesum: 0.00000
title: Mulliken charges with hydrogens summed into heavy atoms:
elementType: O O O O O O O C C C C C C C C C C C C C C C C C C C C C C
charge: -0.196558 -0.124447 -0.138160 -0.203092 -0.267506 -0.167123 -0.251532 0.329366 0.051902 0.039692 0.060812 0.115821 -0.047091 -0.074827 0.332641 -0.025969 0.041656 -0.064963 -0.096211 -0.043229 -0.060000 0.139328 0.564027 0.085498 -0.055679 -0.009527 -0.257264 0.318823 0.003612
polarizability: 2.56507836e+02 -9.29710535e+00 2.66864503e+02 9.66859970e+00 -5.84438919e+00 2.06877184e+02
1716.lowfreq: -11.1994 -6.2547 -0.0002 0.0004 0.0007 9.6504 19.1994 32.8310 40.5967
frequency: 18.9600 32.6500 40.5454 52.1910 70.0009 79.1771 82.8700 94.8353 114.8899 122.3245 135.3554 141.0094 148.6511 165.8608 172.9383 191.4995 201.9324 204.3890 228.7652 243.9835 253.5088 258.8992 267.5474 280.9867 286.8852 291.1409 300.4065 315.2297 330.6540 354.3043 372.6756 383.8709 395.4120 414.5049 434.8100 440.3282 451.2024 469.7816 477.5610 482.3900 520.0212 530.2122 539.3089 559.9134 570.5134 606.4227 620.1088 634.0601 649.6578 675.1641 681.6033 712.6390 730.5291 751.8004 782.4353 803.4637 815.3335 821.8684 838.1335 849.4067 854.4226 878.7033 897.1035 906.7143 911.2513 929.8806 933.3925 937.8605 948.5036 961.5511 964.0979 982.6447 994.0681 994.5260 996.4865 1004.2629 1011.5689 1020.3674 1029.4534 1043.3901 1049.6594 1053.2869 1060.6887 1067.8959 1079.9059 1096.8228 1104.4203 1119.2630 1143.8195 1151.2036 1162.1414 1172.9615 1184.2465 1188.5407 1197.7149 1205.3203 1207.0069 1221.9395 1229.3812 1236.2362 1257.3793 1264.3253 1269.7645 1284.1293 1291.0717 1303.3124 1312.2395 1316.2900 1321.3146 1331.2420 1341.3489 1343.9008 1348.8550 1350.1737 1354.7196 1362.2230 1379.3475 1383.3502 1400.5171 1404.5008 1419.7902 1452.1008 1457.0344 1460.3357 1467.2196 1468.6912 1476.8142 1478.9137 1485.8948 1488.9067 1492.3586 1508.2841 1623.5231 1629.5610 1654.3196 1660.3371 1681.2116 2845.8176 2941.8281 2964.1913 2966.1788 2973.4448 2982.7145 2987.7041 2992.3064 2993.8600 3002.3316 3023.2999 3029.9171 3035.5684 3036.5441 3037.4948 3043.3355 3046.3857 3050.2211 3055.6103 3078.6401 3088.5657 3095.4858 3110.4478 3114.6675 3142.1388 3150.9273 3196.6294 3557.8826
redmass: 6.0922 6.3029 5.2241 5.1644 4.7235 6.2443 5.8754 3.7667 3.0308 1.0635 3.0107 4.7889 2.3439 5.9318 4.0381 4.2543 4.3755 3.9933 4.5706 3.2470 4.7963 4.0984 2.9225 1.3580 2.8969 2.8717 2.9600 2.5679 3.7247 2.5250 2.5885 3.0920 2.8278 2.9748 3.2176 4.8281 3.3305 3.2624 3.0256 2.9898 2.7287 4.9897 3.3875 3.3010 3.6732 4.6288 4.1815 3.9877 4.2656 2.8844 3.5754 2.7553 2.9179 3.3180 3.7134 3.1168 3.5216 3.8126 2.5381 1.6295 3.4259 2.6136 2.6906 3.2283 2.4534 2.3225 2.2073 2.1479 2.3746 1.8585 3.2102 4.0431 2.1256 1.5834 1.6826 2.3654 2.2737 2.8426 3.5184 1.6951 3.6946 2.8353 1.8467 1.9322 2.4838 1.9713 2.0002 3.5870 1.7951 1.9050 1.8477 2.2519 1.5581 1.5990 2.6992 1.4410 1.8244 1.4618 1.7149 1.3050 1.3819 2.1729 1.3345 1.3462 1.3649 1.4642 1.4598 1.2995 1.4409 1.4249 1.4233 1.4175 1.2948 1.3352 1.3985 1.3319 1.4312 1.2526 1.1940 1.1873 1.1844 1.0544 1.0553 1.0867 1.0621 1.0733 1.0802 1.0768 1.0758 1.0774 1.0827 1.0670 11.4765 8.1625 8.7417 9.5783 8.2577 1.0816 1.0815 1.0618 1.0733 1.0636 1.0746 1.0626 1.0458 1.0505 1.0382 1.0971 1.0658 1.0852 1.0816 1.0960 1.0841 1.1008 1.0871 1.1057 1.0954 1.0612 1.0949 1.1000 1.1028 1.1018 1.0951 1.1151 1.0661
irintensity: 0.4638 4.1364 0.9883 3.9035 3.3057 6.2558 4.9414 0.0937 3.1367 0.1800 0.5281 1.9633 4.1900 0.8407 1.2276 0.9857 1.7581 1.6006 6.3977 0.2493 10.0806 8.5236 13.0709 91.2541 34.0865 4.0078 3.5883 2.8643 1.6629 0.7852 3.3878 3.4350 1.8882 0.5366 4.0081 1.4385 5.5886 10.0269 0.5530 0.3116 3.1892 2.3051 2.8272 6.2128 3.4978 0.4576 6.3827 4.9363 3.8047 8.9800 2.3515 0.3500 2.5836 1.1158 5.9890 7.2084 16.5769 32.8418 6.4566 16.3382 12.3352 6.1605 23.8150 47.2368 7.3500 8.9398 17.7420 7.2141 10.1955 1.7435 41.2232 41.8583 32.5599 27.9526 48.0446 114.7810 11.4584 27.1713 5.3029 10.0398 16.3591 8.1776 27.9557 13.3023 46.7862 0.6306 7.0307 22.4527 21.9933 81.0688 58.0236 26.2144 36.5469 54.6011 170.6946 86.0320 20.5522 0.2649 10.7185 2.5900 50.4407 38.1674 4.8223 1.4037 9.6415 10.4522 0.4425 14.9421 4.2327 15.1882 4.9682 1.8845 4.9313 2.9176 3.5537 5.6229 2.0833 58.1531 13.5835 5.6871 30.4922 21.4413 18.9380 12.5181 5.4718 3.8358 11.1668 8.9466 5.0671 37.1303 14.7050 20.4094 91.1958 89.5325 165.4160 205.7008 94.8534 71.4484 5.4894 31.5827 22.9301 9.5338 77.1060 26.8540 14.8366 34.0781 2.5545 45.0463 10.6284 14.3179 26.2245 9.8675 2.9211 40.3520 42.1238 32.8583 47.7337 7.9777 5.5987 16.2478 3.5357 12.1612 20.5016 3.5441 4.5703
temp: 298.150 k
press: 1.00000 atm
elementType: 8 8 8 8 8 8 8 6 6 6 6 6 6 6 6 6 6 6 6 6 6 6 6 6 6 6 6 6 6 1 1 1 1 1 1 1 1 1 1 1 1 1 1 1 1 1 1 1 1 1 1 1 1 1 1 1 1
symmnumber: 1
zpe: 1218394.6 jmol-1
zpe.correction: 0.464062 hartree
zpe.thermalcorrener: 0.491948 hartree
zpe.thermalcorrenthalpy: 0.492892 hartree
zpe.thermalcorrgfe: 0.406863 hartree
zpe.sumelectzpe: -1379.452861 hartree
zpe.sumelectthermal: -1379.424975 hartree
zpe.sumelectthermalent: -1379.424030 hartree
zpe.sumelectthermalfe: -1379.510060 hartree
dipole: -6.2796 -7.3258 -4.1888
dipole: 10.5189
quadrupole: -156.4194 -167.0363 -186.1894
quadrupole: -7.1804 21.3386 3.6951
quadrupole: 13.4623 2.8454 -16.3077 -7.1804 21.3386 3.6951
hfenergy: -1379.9169226 hartree
pointgroup: C01 [X(C22H28O7)]
dipole: -2.4893688 2.986401 1.4181776 debye
polarizability: 257.2433726|9.1260488|265.9299562|-8.6980347|-8.600181|207.076194 unknown
InChI: InChI=1S/C22H28O7/c1-12-14-7-15(25)17-21(11-29-19(27)22(17,8-14)18(12)26)6-4-5-20(3,16(21)9-23)10-28-13(2)24/h9,14-17,25H,1,4-8,10-11H2,2-3H3
charge 0 multiplicity 1
57 atoms
O  -0.301595 0.722557 -2.447686
O  -3.009081 2.439557 -0.065786
O  -0.871959 -2.643292 -0.122131
O  -1.128542 -1.345763 -2.92908
O  3.615057 -0.837622 -0.306542
O  1.347132 -1.226964 1.791215
O  4.744764 -1.904737 1.432773
C  -0.128152 1.480889 -0.058888
C  -1.389516 0.618471 0.350689
C  -1.834195 -0.406056 -0.7979
C  1.172759 0.592876 0.123524
C  -2.601591 1.403509 0.918114
C  -3.367965 -0.293776 -1.103028
C  0.004699 2.782464 0.794699
C  2.552939 1.357081 -0.091153
C  -3.974505 -0.71527 0.263536
C  -0.375154 1.889496 -1.530487
C  -3.779029 0.456006 1.2829
C  -1.808046 -1.815641 -0.109545
C  1.325951 3.546573 0.536243
C  2.57749 2.665217 0.753847
C  -1.063574 -0.402835 -2.117658
C  -3.128472 -1.939624 0.613494
C  3.706799 0.452858 0.41636
C  2.82758 1.658072 -1.594643
C  1.168559 -0.013196 1.531457
C  -3.439644 -2.99988 1.399307
C  4.093265 -1.976658 0.368808
C  3.665257 -3.225323 -0.361616
H  -1.080986 0.000853 1.22101
H  1.161743 -0.257948 -0.580353
H  -2.275232 1.920975 1.844236
H  -3.625376 -1.018954 -1.894909
H  -3.666686 0.717599 -1.414854
H  -0.051392 2.529165 1.872989
H  -0.856987 3.440638 0.579315
H  -5.044402 -0.975144 0.194269
H  -1.374551 2.350797 -1.611977
H  0.377627 2.580309 -1.926228
H  -4.70719 1.060209 1.33658
H  -3.613576 0.044028 2.296474
H  1.331297 3.962208 -0.489843
H  1.372746 4.419259 1.215686
H  3.488063 3.243361 0.500933
H  2.655374 2.413736 1.832138
H  3.662749 0.254332 1.503703
H  4.685241 0.919052 0.19361
H  3.913517 1.798594 -1.74998
H  2.499263 0.827203 -2.239822
H  2.333922 2.580608 -1.941684
H  1.011467 0.708882 2.375588
H  -3.798213 2.921005 0.290282
H  -4.406599 -3.092793 1.90739
H  -2.712607 -3.810351 1.532086
H  3.786547 -3.107019 -1.45065
H  2.589942 -3.390613 -0.162685
H  4.239968 -4.090179 0.000272
