program: Gaussian 09
title: 000122594
version: EM64L-G09RevD.01
frameworkgroup: C1[X(C9H14N2)]
method: RPBEPBE
basis: SDD
operation: Freq
keyword: #pfreq=noraman
keyword: PBEPBE/SDD
title: #p freq=noraman PBEPBE/SDD
converged: YES YES NO NO
title: Mulliken charges:
elementType: N N C C C C C C C C C H H H H H H H H H H H H H H
charge: 0.000648 -0.043232 -0.460191 -0.369265 0.129112 0.037521 -0.684235 0.218063 -0.796857 -0.424628 -0.779637 0.221611 0.199843 0.199301 0.228312 0.214869 0.209549 0.222107 0.228886 0.234973 0.257086 0.244358 0.229905 0.229207 0.252694
chargesum: 0.00000
title: Mulliken charges with hydrogens summed into heavy atoms:
elementType: N N C C C C C C C C C
charge: 0.000648 -0.043232 -0.038737 0.058348 0.129112 0.037521 -0.037710 0.218063 -0.075912 -0.180270 -0.067831
polarizability: 1.49416991e+02 8.86798014e+00 1.09751361e+02 -6.16233166e+00 1.53684819e+00 7.20590473e+01
1716.lowfreq: -46.1893 0.0003 0.0006 0.0006 4.5659 12.4797 15.4593 45.7836 59.5479
frequency: -45.9668 45.4526 59.5361 89.6221 125.5560 155.6731 213.7621 227.5792 266.9555 290.7067 313.5390 376.1093 450.3251 465.4596 526.8462 559.7206 585.8512 685.5863 739.8189 754.0724 802.1600 863.9610 887.7958 910.4823 948.1319 959.7952 1023.1461 1037.4740 1047.5584 1051.6707 1052.6231 1089.6778 1153.2745 1217.7470 1246.9638 1253.7752 1271.4968 1289.7570 1291.5783 1333.6398 1351.2146 1388.8833 1390.6361 1393.4825 1422.4482 1453.9206 1463.7271 1469.3289 1470.2027 1471.4621 1474.7711 1477.4146 1486.3049 1513.9435 1537.3486 2973.3533 2980.4875 2981.6135 2984.7924 3000.9339 3031.1154 3059.5276 3061.5792 3063.6308 3074.4169 3076.8168 3113.5886 3114.0464 3127.4763
redmass: 1.0635 3.1492 3.3200 1.6733 1.0280 3.2234 3.3482 1.1258 2.6611 2.6011 2.4531 4.3851 2.7015 6.1155 3.6632 5.2044 3.4482 7.1128 1.1995 2.9006 4.7183 1.3100 1.9218 1.3540 3.1727 1.6048 2.1161 1.5576 1.6651 2.4035 1.7098 2.1344 2.4517 1.9432 4.6481 2.1011 1.5697 1.2092 1.6091 1.4662 3.7552 1.2147 1.2411 1.3384 2.2198 1.2419 1.1939 1.0559 1.0733 1.1446 1.0492 1.0481 1.0817 4.5846 5.2867 1.0356 1.0611 1.0386 1.0379 1.0593 1.0984 1.0972 1.1015 1.0974 1.0993 1.1026 1.0983 1.0984 1.0925
irintensity: 0.5366 0.1039 0.3191 0.0125 0.6832 0.2126 5.3835 0.0415 1.3211 1.7697 0.1747 3.2917 1.4784 4.6270 0.3718 0.7462 0.9600 1.3631 6.2771 3.7734 1.1325 1.3627 5.9718 4.6880 9.0549 2.5611 18.1349 15.5833 1.2628 0.9203 1.1050 20.8685 9.1148 0.5757 2.0169 1.3760 2.1466 1.2193 6.3616 4.4424 19.3697 15.9643 29.4954 14.8129 53.1048 43.8714 15.7694 6.8481 26.0797 28.0130 5.9379 10.2256 19.7176 5.0956 3.3290 43.5119 13.8258 16.7804 18.5877 42.5663 0.8367 14.0664 2.1395 19.6504 48.0503 79.2603 5.2873 13.8166 25.7690
temp: 298.150 k
press: 1.00000 atm
elementType: 7 7 6 6 6 6 6 6 6 6 6 1 1 1 1 1 1 1 1 1 1 1 1 1 1
symmnumber: 1
zpe: 556702.2 jmol-1
zpe.correction: 0.212037 hartree
zpe.thermalcorrener: 0.223393 hartree
zpe.thermalcorrenthalpy: 0.224337 hartree
zpe.thermalcorrgfe: 0.174269 hartree
zpe.sumelectzpe: -460.016739 hartree
zpe.sumelectthermal: -460.005382 hartree
zpe.sumelectthermalent: -460.004438 hartree
zpe.sumelectthermalfe: -460.054506 hartree
dipole: 0.3128 0.4213 0.1875
dipole: 0.5573
quadrupole: -60.7429 -68.6309 -67.8402
quadrupole: 6.1166 -0.2996 -1.7455
quadrupole: 4.9950 -2.8929 -2.1022 6.1166 -0.2996 -1.7455
hfenergy: -460.2287752 hartree
pointgroup: C01 [X(C9H14N2)]
dipole: -0.1248201 0.1683602 -0.0643586 debye
dipolederiv: -0.2645776 -0.1248869 -0.0118766 0.0185927 -0.1853792 0.0258923 -0.0119301 0.034028 -0.2523327 -0.3508908 0.0512616 0.0179165 0.0451002 -0.2870097 -0.0152884 0.0172541 -0.0098844 -0.2682738 -0.2729719 -0.0110961 -0.0500303 -0.0827444 0.1479088 0.0100837 -0.2209755 -0.0185474 0.0330014 0.0722023 0.0058517 0.0283622 0.0441624 0.1507667 -0.0174816 0.2146235 -0.010332 0.100563 0.6600939 -0.0494024 -0.0273025 0.3118273 -0.259041 -0.062344 -0.1193978 0.0248203 0.0259685 -0.1130754 -0.0897713 0.005941 -0.4702244 0.5311269 0.0679148 0.0749707 0.0086394 0.0651406 -0.0807208 -0.0123932 -0.0019764 -0.0298728 0.1002187 -0.0016108 -0.1024432 -0.0091831 0.0610989 0.6915783 -0.1337825 -0.1108232 0.2186216 -0.1047137 -0.017544 -0.1296361 0.0359797 0.1109977 -0.0521187 0.1643625 0.0099986 0.1382135 -0.1968556 -0.0204662 0.0179974 -0.0452634 0.044629 -0.2542756 0.0927665 0.0208429 -0.3736803 0.2595382 0.0278799 0.0680551 -0.0423654 -0.068187 -0.2902306 0.0451586 0.0607396 0.0897455 0.0351354 -0.0127039 0.054982 -0.007157 0.0393288 0.0321752 -0.0219039 0.0304377 -0.0602617 -0.0243201 0.116583 0.0472704 0.067079 -0.0140614 0.0217253 0.0406335 0.0226564 0.0667113 -0.0788365 -0.1189695 0.0277082 -0.0721132 0.018263 0.018766 -0.0632718 0.037788 -0.0454588 -0.0626756 0.1416933 0.0374718 0.0988389 -0.045216 0.0172852 0.0708658 0.0306388 0.0445473 -0.0675678 -0.1087919 0.0237374 -0.0650889 0.0209705 0.0514592 -0.0148905 0.020237 -0.0657454 -0.0559568 0.1245385 0.0824642 0.1305994 -0.0144574 0.0398715 0.0349144 0.0276511 0.1026549 -0.108051 -0.1003166 0.0732243 -0.0959056 0.0411561 -0.0801652 -0.0262321 -0.1100811 -0.0299336 0.094225 -0.0317953 -0.1527217 -0.0350341 -0.0959494 -0.0418361 0.0430398 -0.108957 0.024761 0.0665174 -0.0241572 -0.1199765 0.0208161 0.0154903 0.0812427 0.0455459 0.0729358 0.0374856 0.0453998 -0.0087271 0.0735897 -0.0591024 -0.0824424 0.0214484 -0.1455735 0.0377201 -0.0465967 -0.0009526 0.0265246 0.0295938 0.0563455 0.1008223 0.0204834 0.085859 0.0125089 0.1248438 -0.0596672 -0.0090034 0.0146248 -0.0025171 0.1260793 -0.0266626 0.0315208 -0.0486503 0.04436 0.0743191 0.0877799 -0.1042857 0.0749139 -0.0256351 0.0293434 0.0014407 0.0226153 0.016858 0.0438776 -0.1172859 0.0835517 -0.0971748 -0.0479036 0.0698502 -0.0200165 0.0107075 -0.1239671 -0.0580069 0.0375957 0.0202477 0.0176086 0.1109491 unknown
polarizability: 149.5361312|-8.1511752|109.6524136|-6.8421044|0.4713431|72.0388542 unknown
InChI: InChI=1S/C9H14N2/c1-4-5-9-8(3)11-7(2)6-10-9/h6H,4-5H2,1-3H3
charge 0 multiplicity 1
25 atoms
N  0.185965 -1.379467 0.344388
N  1.65133 1.003427 -0.105329
C  -1.927535 -0.174034 0.650053
C  -2.74373 -0.381835 -0.659383
C  -0.435881 -0.157556 0.391776
C  0.307283 1.043824 0.165068
C  -4.262725 -0.438771 -0.395626
C  2.270414 -0.218136 -0.15463
C  -0.328762 2.416305 0.215905
C  1.520211 -1.401238 0.073736
C  3.752333 -0.245675 -0.454544
H  -2.15009 -1.010728 1.337508
H  -2.254176 0.762607 1.138726
H  -2.51608 0.435716 -1.372607
H  -2.403701 -1.321504 -1.134503
H  -4.513184 -1.268656 0.291502
H  -4.624196 0.500004 0.065217
H  -4.826592 -0.59447 -1.333405
H  -1.201682 2.490245 -0.458153
H  -0.682734 2.660312 1.235663
H  0.418127 3.168231 -0.082303
H  1.996965 -2.387492 0.042017
H  4.32358 -0.700252 0.376196
H  3.969596 -0.83713 -1.363275
H  4.113967 0.782971 -0.608096
