program: Gaussian 09
title: 000122545
version: EM64L-G09RevD.01
frameworkgroup: C1[X(C13H24O2)]
method: RPBEPBE
basis: SDD
operation: Freq
keyword: #pfreq=noraman
keyword: PBEPBE/SDD
title: #p freq=noraman PBEPBE/SDD
converged: YES YES NO NO
title: Mulliken charges:
elementType: O O C C C C C C C C C C C C C H H H H H H H H H H H H H H H H H H H H H H H H
charge: -0.267336 -0.249577 0.354648 -0.049824 -0.488710 -0.460460 -0.037536 -0.468682 -0.737408 -0.752218 -0.555364 -0.749073 0.250290 -0.262019 -0.665283 0.220543 0.212689 0.192005 0.186786 0.194481 0.214592 0.195439 0.197964 0.211472 0.213918 0.206556 0.209963 0.211712 0.210610 0.235146 0.243888 0.214846 0.206858 0.213695 0.221828 0.233550 0.216540 0.248857 0.224615
chargesum: 0.00000
title: Mulliken charges with hydrogens summed into heavy atoms:
elementType: O O C C C C C C C C C C C C C
charge: -0.267336 -0.249577 0.354648 0.170719 -0.084015 -0.079194 0.177056 -0.075279 -0.105462 -0.119933 -0.076330 -0.113674 0.250290 0.193359 0.024729
polarizability: 1.64786112e+02 -8.11519481e+00 1.38607136e+02 6.37837592e-01 -1.87187046e+00 1.25989213e+02
1716.lowfreq: -14.0221 -10.9967 -3.2526 -0.0006 -0.0003 -0.0002 15.6998 26.2024 62.7269
frequency: -3.8887 25.9804 62.6797 75.2799 87.7895 127.0838 150.2549 162.5763 198.7412 204.2535 220.7026 233.4310 252.3013 267.6353 277.7232 302.9294 327.8680 337.8862 382.0698 396.7860 404.1927 433.9867 436.5384 470.6119 488.2018 586.8853 612.2610 688.3620 746.7921 777.6548 802.4906 818.3641 833.7010 854.1149 863.2985 898.1803 907.8778 921.2184 933.0673 944.1699 969.3741 983.1076 998.9125 1014.1628 1030.7057 1054.3683 1080.3088 1089.3831 1096.2182 1109.3318 1117.2525 1155.2683 1157.3161 1173.2820 1187.6687 1213.7752 1250.5687 1257.4811 1276.8055 1281.0113 1288.5603 1293.1583 1311.2685 1324.8011 1339.0505 1342.8393 1354.1390 1356.4634 1366.7581 1376.7285 1382.6516 1386.5700 1397.4953 1444.4494 1450.0217 1451.6261 1456.0997 1460.5431 1461.4997 1467.7527 1471.5407 1474.4078 1476.7807 1479.5568 1483.7663 1494.2220 1635.8308 2941.6395 2950.7974 2957.1532 2961.1882 2963.2855 2965.2016 2974.6899 2984.1114 2990.4258 2993.1513 3003.1420 3011.7642 3017.5340 3027.8133 3056.2263 3057.3382 3058.9003 3062.6361 3064.4206 3083.3894 3085.3976 3090.9931 3099.1148 3117.0163
redmass: 3.6480 3.5279 2.7224 4.8716 3.2358 2.2981 2.2598 2.2012 1.1129 1.2967 1.2972 1.3988 2.1690 2.2761 1.7993 2.5196 2.7317 2.5797 3.2937 2.2620 2.1393 1.8265 2.5532 2.5889 3.2654 3.3073 3.5380 3.9569 3.0424 2.6637 1.6675 1.9415 2.0752 1.6206 1.7710 3.2020 2.0531 1.9213 1.4673 1.8087 1.8832 1.6092 1.3994 2.6572 1.6716 1.7003 2.6509 1.8816 1.9456 1.7990 1.5395 1.6620 1.8381 2.1317 1.9988 1.5779 1.8276 2.2545 1.1210 1.3686 1.2881 1.4530 1.5476 1.5137 1.4947 1.4986 1.3216 1.5060 1.3245 1.2212 1.2217 1.2327 1.2078 1.0883 1.0826 1.0824 1.0901 1.0543 1.0660 1.0545 1.0500 1.0639 1.0620 1.0596 1.0514 1.0596 9.0005 1.0603 1.0620 1.0573 1.0394 1.0459 1.0683 1.0382 1.0702 1.0357 1.0797 1.1007 1.1004 1.1004 1.0595 1.0995 1.0992 1.0990 1.0987 1.0991 1.0972 1.0978 1.1027 1.0912 1.1061
irintensity: 0.9669 0.1631 0.4201 1.5712 0.8445 0.2999 0.5239 2.6141 0.5809 1.7961 0.6583 0.3311 0.3495 1.2985 1.4102 10.5517 0.4405 1.2702 5.1952 0.5529 0.2537 0.6463 2.2546 0.4065 0.7546 4.1972 1.4399 9.3587 0.6840 5.4719 2.3422 2.1779 1.6086 4.9379 2.5648 14.9948 0.5967 6.2449 1.1537 3.9210 7.3191 2.4139 1.0797 54.3097 14.0683 1.2048 3.6664 74.6797 7.3280 78.3209 76.0887 10.5945 0.3069 31.8182 30.8426 13.7557 30.6334 4.4015 4.1626 6.8627 2.3916 33.7615 2.9732 8.3910 10.4542 2.3971 1.8422 2.4756 10.3627 22.8186 7.9549 23.4685 16.6731 12.5397 3.4275 4.8615 13.9342 12.0509 4.5185 0.3182 7.5151 13.5893 19.0021 13.0548 13.1003 30.4621 142.5532 28.8273 23.2654 12.3299 61.2933 21.8229 69.3186 29.8048 14.1925 16.8022 39.4339 29.0017 24.4853 62.0751 34.7990 2.8017 28.5959 81.7345 56.9777 73.5005 42.3739 42.7070 2.5722 16.0194 33.1896
temp: 298.150 k
press: 1.00000 atm
elementType: 8 8 6 6 6 6 6 6 6 6 6 6 6 6 6 1 1 1 1 1 1 1 1 1 1 1 1 1 1 1 1 1 1 1 1 1 1 1 1
symmnumber: 1
zpe: 907715.3 jmol-1
zpe.correction: 0.345731 hartree
zpe.thermalcorrener: 0.362350 hartree
zpe.thermalcorrenthalpy: 0.363294 hartree
zpe.thermalcorrgfe: 0.302147 hartree
zpe.sumelectzpe: -659.019120 hartree
zpe.sumelectthermal: -659.002500 hartree
zpe.sumelectthermalent: -659.001556 hartree
zpe.sumelectthermalfe: -659.062703 hartree
dipole: 0.1266 0.6612 -1.3721
dipole: 1.5284
quadrupole: -87.8137 -93.8012 -98.4557
quadrupole: -4.0673 5.6723 2.0747
quadrupole: 5.5432 -0.4443 -5.0988 -4.0673 5.6723 2.0747
hfenergy: -659.3648501 hartree
pointgroup: C01 [X(C13H24O2)]
dipole: -0.0611639 0.2950901 0.5203545 debye
polarizability: 164.563327|8.4535051|139.0131305|0.6429955|1.1351045|125.8060031 unknown
InChI: InChI=1S/C13H24O2/c1-5-15-12(14)7-11-6-10(2)8-13(3,4)9-11/h10-11H,5-9H2,1-4H3
charge 0 multiplicity 1
39 atoms
O  2.632291 -0.414184 1.003556
O  2.502745 -1.196776 -1.191176
C  -1.337704 1.445728 -0.249541
C  -0.483597 -1.01236 -0.819051
C  -0.542538 0.495377 -1.20167
C  -2.719165 0.802741 0.081171
C  -2.637773 -0.661189 0.581802
C  -1.903257 -1.531977 -0.468777
C  -0.561467 1.770249 1.057791
C  -1.573482 2.785381 -0.999346
C  0.537778 -1.371909 0.2995
C  -4.043795 -1.224251 0.883583
C  1.961792 -1.002887 -0.076514
C  4.052675 -0.006122 0.765376
C  4.116011 1.395114 0.150111
H  -0.130389 -1.551406 -1.721349
H  0.483394 0.890163 -1.346047
H  -1.031064 0.547732 -2.197297
H  -3.346569 0.816406 -0.836887
H  -3.24399 1.429172 0.832024
H  -2.057733 -0.68162 1.528563
H  -1.846783 -2.582728 -0.117097
H  -2.516968 -1.541884 -1.394666
H  -0.484883 0.906398 1.738831
H  0.467875 2.108441 0.833936
H  -1.073537 2.581436 1.610196
H  -2.16428 3.486495 -0.379144
H  -0.612962 3.277815 -1.245477
H  -2.123609 2.621864 -1.945619
H  0.515361 -2.472323 0.440942
H  0.294874 -0.917354 1.271161
H  -4.569684 -0.609062 1.63776
H  -4.666016 -1.238435 -0.032625
H  -3.988547 -2.260372 1.268021
H  4.504066 -0.038962 1.76992
H  4.52817 -0.75412 0.106464
H  5.169944 1.719054 0.064008
H  3.671927 1.39724 -0.859406
H  3.58079 2.126216 0.780972
