program: Gaussian 09
title: 000122577
version: EM64L-G09RevD.01
frameworkgroup: C1[X(C15H10N8OS2)]
method: RPBEPBE
basis: SDD
operation: Freq
keyword: #p
keyword: freq=noraman
keyword: PBEPBE/SDD
title: #p freq=noraman PBEPBE/SDD
converged: YES YES NO NO
title: Mulliken charges:
elementType: S S O N N N N N N N N C C C C C C C C C C C C C C C H H H H H H H H H H
charge: 0.375785 0.366044 -0.102491 -0.259984 -0.245359 -0.018524 -0.018810 -0.032343 -0.041481 -0.082396 -0.083402 0.481707 0.479308 -0.355176 -0.341027 -0.356214 -0.351563 -0.211708 -0.224813 -0.205658 -0.194952 -0.200558 -0.198578 -0.228779 -0.229574 -0.243416 0.281535 0.257422 0.267075 0.269660 0.245051 0.239469 0.240770 0.241000 0.241077 0.240905
chargesum: 0.00000
title: Mulliken charges with hydrogens summed into heavy atoms:
elementType: S S O N N N N N N N N C C C C C C C C C C C C C C C
charge: 0.375785 0.366044 -0.102491 -0.259984 -0.245359 -0.018524 -0.018810 -0.032343 -0.041481 -0.082396 -0.083402 0.481707 0.479308 -0.073641 -0.083605 -0.089139 -0.081904 -0.211708 -0.224813 0.039393 0.044517 0.040212 0.042423 0.012298 0.011331 -0.243416
polarizability: 2.83277342e+02 5.41219725e+00 2.94561479e+02 -7.52510941e-01 5.00518008e+00 1.85212845e+02
1716.lowfreq: -6.3343 -0.0019 -0.0014 0.0008 3.3432 5.1873 11.8999 14.4682 21.5838
frequency: 10.8107 13.6487 21.5257 27.2470 36.0411 47.5420 75.3288 85.9410 90.2263 102.1654 114.0814 123.2083 170.0987 213.5671 223.6215 227.3239 250.5273 313.8838 324.6262 352.7682 361.0678 397.9526 405.3024 406.4542 424.2745 440.6807 468.6706 480.4283 514.3003 528.6001 540.2750 552.2323 610.0875 610.8669 667.9907 670.6834 681.2108 683.9247 684.4858 692.0589 693.9918 696.5020 753.2669 768.5012 769.5609 841.5094 846.8459 894.1572 894.7300 918.0276 918.6893 936.2046 938.2512 978.6064 980.4411 989.0381 989.2986 989.6855 990.6423 996.8891 997.1973 1002.6295 1003.7635 1032.6769 1033.9951 1084.0334 1086.0754 1105.7129 1109.6695 1177.3434 1178.1868 1179.1469 1182.3181 1189.8962 1191.1270 1284.6264 1289.5292 1324.2937 1326.2369 1365.1633 1366.1768 1386.7713 1388.2039 1447.1123 1448.9724 1483.8859 1484.5797 1598.4848 1600.0411 1606.7768 1607.4944 1642.7625 3141.5620 3141.9422 3151.6461 3152.5720 3163.0844 3164.4739 3173.3986 3174.3141 3181.5684 3182.8461
redmass: 7.2906 7.1352 6.9659 4.7555 4.4437 9.0587 14.4958 8.2527 9.2664 9.6643 7.0924 7.3709 9.8672 7.2151 9.0295 10.0833 10.4151 6.9371 7.0191 7.6279 8.1565 15.4001 2.8440 2.8631 9.8971 8.5391 8.3368 9.2505 12.1019 6.0111 4.9444 7.8244 6.5689 6.5750 9.7937 10.5962 7.9754 6.9555 7.5782 2.1590 3.4270 3.8340 11.2631 1.6968 1.6561 1.2510 1.2451 13.8160 13.7755 2.3336 2.4025 2.9287 2.3492 1.3941 1.4550 7.4043 6.4815 10.4947 7.5723 8.4375 8.2941 1.3330 1.3393 2.0159 2.0116 1.7607 1.7416 6.5194 6.7817 1.1067 1.0539 2.9268 2.9117 1.3150 1.3930 7.7024 6.8034 1.3927 1.4277 5.4926 5.4481 10.1282 10.3562 2.2847 2.3121 2.5127 2.5112 6.6537 6.6757 6.0692 6.1002 13.2541 1.0860 1.0858 1.0893 1.0896 1.0937 1.0936 1.0974 1.0966 1.1010 1.1005
irintensity: 3.1073 3.1983 0.4034 0.2784 0.1473 0.7842 2.2758 0.5048 0.0840 1.5188 0.6221 0.7486 0.1188 1.1901 0.0550 0.3240 2.1000 4.3770 2.6575 0.5526 0.1499 3.0030 0.0522 0.0303 4.2462 3.7922 19.0568 8.6291 11.4526 12.8362 6.8196 0.4083 0.8792 0.2343 3.1857 6.3436 40.6669 6.3105 4.5609 56.3870 27.1081 8.2360 458.6576 54.7171 66.3304 0.4516 0.3769 3.0425 6.8935 25.5940 1.2317 11.6113 11.1442 0.4780 1.0548 8.3410 2.5069 0.9055 0.1952 17.3269 11.6215 0.2147 0.1640 2.0067 2.2210 6.9247 9.6851 0.9004 2.5011 2.0787 0.1006 17.1980 17.6014 0.6402 0.9277 7.7014 33.8851 2.2998 4.4105 5.6726 13.6366 2.0896 1.9236 7.0238 9.7133 41.9349 40.4737 3.6938 3.1930 2.4185 2.3005 111.0896 0.2597 0.2115 6.4663 9.4518 15.8232 10.8946 7.6924 3.3416 10.4181 4.5257
temp: 298.150 k
press: 1.00000 atm
elementType: 16 16 8 7 7 7 7 7 7 7 7 6 6 6 6 6 6 6 6 6 6 6 6 6 6 6 1 1 1 1 1 1 1 1 1 1
symmnumber: 1
zpe: 623630.4 jmol-1
zpe.correction: 0.237528 hartree
zpe.thermalcorrener: 0.259790 hartree
zpe.thermalcorrenthalpy: 0.260734 hartree
zpe.thermalcorrgfe: 0.180262 hartree
zpe.sumelectzpe: -1885.011383 hartree
zpe.sumelectthermal: -1884.989121 hartree
zpe.sumelectthermalent: -1884.988177 hartree
zpe.sumelectthermalfe: -1885.068650 hartree
dipole: -1.5864 0.4104 1.4073
dipole: 2.1600
quadrupole: -140.1501 -188.6958 -160.7241
quadrupole: 37.4736 2.3307 0.2410
quadrupole: 23.0399 -25.5058 2.4659 37.4736 2.3307 0.2410
hfenergy: -1885.2489118 hartree
pointgroup: C01 [X(C15H10N8O1S2)]
dipole: -0.6571959 -0.3040735 -0.4447627 debye
polarizability: 281.2870963|-1.1627162|261.1193768|0.7075915|-52.1170297|220.6451929 unknown
InChI: InChI=1S/C15H10N8OS2/c24-15(25-13-16-18-20-22(13)11-7-3-1-4-8-11)26-14-17-19-21-23(14)12-9-5-2-6-10-12/h1-10H
charge 0 multiplicity 1
36 atoms
S  -1.817924 -1.73242 -1.797558
S  1.131669 -1.2030 -2.323415
O  -0.206854 -0.253828 -0.077672
N  -3.771695 -0.708943 0.013455
N  2.998851 -0.24235 -0.385755
N  -4.468229 -1.141752 1.162499
N  3.813598 0.893351 -0.183628
N  -2.934656 -2.70937 0.571415
N  2.69366 1.105855 -2.147844
N  -3.944252 -2.348285 1.480064
N  3.61941 1.685797 -1.261603
C  -4.103616 0.547313 -0.606142
C  2.953177 -1.284656 0.605591
C  -3.081231 1.463596 -0.941199
C  2.969883 -2.64215 0.211224
C  -5.465866 0.843726 -0.841344
C  2.916019 -0.915606 1.96957
C  -2.849507 -1.686337 -0.3189
C  2.328585 -0.074851 -1.583773
C  -3.434277 2.685949 -1.552096
C  2.922239 -3.643055 1.204992
C  -5.803727 2.073541 -1.443438
C  2.879436 -1.927155 2.950979
C  -4.790856 2.992077 -1.807314
C  2.875097 -3.290332 2.573234
C  -0.281326 -0.900291 -1.125098
H  -2.038312 1.247352 -0.693159
H  3.032399 -2.916527 -0.846068
H  -6.236783 0.123052 -0.552804
H  2.912428 0.142663 2.245095
H  -2.649257 3.402673 -1.813713
H  2.930572 -4.696899 0.908672
H  -6.855797 2.312136 -1.629696
H  2.845647 -1.649877 4.009401
H  -5.057975 3.943978 -2.277841
H  2.83697 -4.071674 3.339167
