program: Gaussian 09
title: 000122627
version: EM64L-G09RevD.01
frameworkgroup: C1[X(C16H18N6O5)]
method: RPBEPBE
basis: SDD
operation: Freq
keyword: #p
keyword: freq=noraman
keyword: PBEPBE/SDD
title: #p freq=noraman PBEPBE/SDD
converged: YES YES NO NO
title: Mulliken charges:
elementType: O O O O O N N N N N N C C C C C C C C C C C C C C C C H H H H H H H H H H H H H H H H H H
charge: -0.281847 -0.309245 -0.272245 -0.279789 -0.245153 -0.188499 -0.060829 -0.395375 -0.021743 -0.093210 -0.044251 -0.197498 -0.079355 -0.485334 0.001022 -0.297587 0.207001 -0.038025 -0.316382 0.154196 0.150185 0.205123 -0.469724 -0.313235 -0.196424 -0.176016 -0.609318 0.288238 0.243560 0.279048 0.248624 0.283782 0.253750 0.251264 0.281003 0.359080 0.257270 0.230914 0.231082 0.278448 0.214745 0.237048 0.232906 0.241682 0.241111
chargesum: 0.00000
title: Mulliken charges with hydrogens summed into heavy atoms:
elementType: O O O O O N N N N N N C C C C C C C C C C C C C C C C
charge: -0.281847 -0.309245 -0.272245 -0.279789 -0.245153 -0.188499 -0.060829 -0.036295 -0.021743 -0.093210 -0.044251 0.090741 0.164205 0.042338 0.284804 0.207427 0.207001 0.242978 -0.059111 0.154196 0.150185 0.205123 -0.007728 -0.034787 0.018320 0.061032 0.106381
polarizability: 3.26468633e+02 7.39103683e+00 2.17049776e+02 2.00597612e+00 7.23074409e+00 1.76569252e+02
1716.lowfreq: -6.2224 -2.2837 -0.0008 -0.0006 0.0006 5.4937 11.6904 17.1821 18.0064
frequency: 11.5430 17.0139 17.5972 23.5092 33.2844 45.7100 58.6599 63.9331 78.2926 80.9470 104.8839 140.4425 145.1760 156.4198 167.2362 173.0745 183.2396 196.9055 227.4638 242.1719 272.4998 274.2171 291.9586 352.5957 373.3734 375.2455 386.7096 405.1778 425.8974 432.4564 479.4282 485.9622 505.8003 517.7972 520.3868 525.5594 539.0618 566.4302 601.5462 655.0589 681.1420 684.5503 688.4740 700.5976 708.8338 730.8371 738.2130 746.6476 762.3987 773.1721 806.9027 815.5548 825.7701 864.6093 909.1692 923.9267 928.2940 930.0024 933.2641 941.1481 950.4281 952.1817 988.7875 989.0761 996.9327 1018.0289 1024.6847 1027.5084 1057.2731 1076.8264 1096.9688 1117.0704 1133.3472 1137.2526 1165.8633 1181.8737 1192.8114 1194.0887 1201.8312 1204.1686 1213.1198 1245.1419 1256.0985 1262.5248 1274.0046 1277.4858 1307.2505 1314.5845 1317.1442 1330.8546 1340.7600 1362.8686 1365.5607 1370.3937 1383.0821 1386.1041 1412.1527 1427.3628 1449.7792 1456.4243 1468.7430 1469.0880 1482.0761 1495.0551 1594.0701 1595.5292 1625.5773 1633.3898 1665.2953 1694.7147 2043.8986 2941.6117 2965.3445 2973.4608 3004.2595 3028.3427 3029.0035 3042.0371 3050.1130 3065.8382 3097.6664 3110.0171 3112.8196 3145.0227 3156.6028 3176.4174 3201.4671 3221.5780 3524.2218
redmass: 6.7986 4.9721 8.8574 8.4187 6.4084 6.3002 4.5628 3.4226 1.8146 2.7432 5.9922 5.6904 6.5955 7.4112 2.6950 6.9099 3.8845 5.9153 8.0889 3.4367 4.3039 4.6640 6.0946 5.4463 4.2454 9.4245 3.6068 3.5912 3.4986 3.6987 5.3547 11.2468 5.0604 3.8960 6.2391 2.3172 6.0158 7.2737 6.2228 6.5590 4.5963 3.2612 5.0625 2.3274 3.2184 1.5021 7.3997 6.9554 2.6141 3.3841 1.8993 4.1295 5.1253 2.9427 3.3310 2.7717 4.1648 1.4137 1.2083 3.0069 3.3410 1.3844 2.4725 1.7925 2.8940 4.4292 2.7296 3.5343 2.3070 2.2247 1.5812 1.2916 2.1433 1.5790 3.6615 1.7915 1.0838 1.1533 1.4569 2.3812 1.4258 1.4324 2.6763 4.3021 1.6614 1.5257 1.4158 1.3675 1.3457 2.3386 1.4072 1.6312 1.6666 2.2293 2.0173 1.7382 2.3881 2.3663 1.2923 1.0961 1.0425 1.0767 1.0918 1.1169 8.7070 5.6549 7.8419 10.3209 6.2132 6.0676 13.5789 1.0593 1.1004 1.0358 1.0844 1.0633 1.0660 1.0788 1.1024 1.0880 1.1079 1.0985 1.1021 1.0858 1.0930 1.1004 1.0884 1.0994 1.0770
irintensity: 0.1937 0.0424 0.2814 0.1849 3.0820 1.9683 0.8457 2.8454 0.4118 0.0732 2.1037 1.0437 2.9268 3.6151 1.2606 3.1305 2.8094 2.7534 9.6230 5.3571 8.7727 8.7456 13.1096 9.9276 0.1321 11.8115 14.3774 11.4957 0.0089 4.0404 3.3270 2.9252 14.8101 12.4074 8.3630 34.6777 4.5711 8.8264 5.1005 0.1406 1.5897 15.5019 41.7623 7.7559 2.7098 19.2946 22.7806 7.9108 20.7613 37.3187 104.7020 14.3358 19.6758 47.2226 1.3096 9.5966 2.3058 10.2058 2.9603 3.1558 0.9927 2.8520 35.0734 8.1596 43.2357 733.7051 3.5072 55.2696 3.3990 117.3557 10.7519 0.9928 4.3579 20.6474 522.0213 25.7804 0.8450 13.7680 3.9754 24.8809 30.0628 84.8615 68.1045 78.1435 91.8758 22.3395 15.8771 1.4131 42.3725 91.5155 12.6195 15.8437 24.5034 11.9793 23.8089 19.2493 44.0658 85.5412 15.8934 14.3827 13.7208 13.5144 2.3691 39.2618 589.4622 58.7998 95.1187 285.9153 749.1528 115.5396 342.0258 56.6308 27.0488 104.1761 17.9438 5.0166 20.8322 36.1286 30.2355 12.3647 19.6511 11.8330 9.0289 2.0415 1.0624 28.8253 5.0115 1.1940 60.6947
temp: 298.150 k
press: 1.00000 atm
elementType: 8 8 8 8 8 7 7 7 7 7 7 6 6 6 6 6 6 6 6 6 6 6 6 6 6 6 6 1 1 1 1 1 1 1 1 1 1 1 1 1 1 1 1 1 1
symmnumber: 1
zpe: 893138.7 jmol-1
zpe.correction: 0.340179 hartree
zpe.thermalcorrener: 0.365542 hartree
zpe.thermalcorrenthalpy: 0.366487 hartree
zpe.thermalcorrgfe: 0.279449 hartree
zpe.sumelectzpe: -1323.088188 hartree
zpe.sumelectthermal: -1323.062824 hartree
zpe.sumelectthermalent: -1323.061880 hartree
zpe.sumelectthermalfe: -1323.148917 hartree
dipole: -10.2390 -3.5637 -1.4208
dipole: 10.9342
quadrupole: -144.4568 -159.6741 -169.7394
quadrupole: -10.2264 -14.1601 0.7764
quadrupole: 13.4999 -1.7174 -11.7826 -10.2264 -14.1601 0.7764
hfenergy: -1323.4283663 hartree
pointgroup: C01 [X(C16H18N6O5)]
dipole: 4.0345807 1.2885657 -0.7533859 debye
polarizability: 326.5360996|6.2948777|214.31974|-3.4868495|-12.3401005|179.2318212 unknown
InChI: InChI=1S/C16H18N6O5/c1-21-5-2-3-10(8-21)15(24)26-9-12-11(19-20-17)7-14(27-12)22-6-4-13(23)18-16(22)25/h2,4-6,8,11-12,14,18H,3,7,9H2,1H3
charge 0 multiplicity 1
45 atoms
O  -1.595477 -0.194353 -1.824637
O  1.926292 -0.11128 -0.714462
O  -5.239863 1.660926 -1.176247
O  2.799375 -2.273032 -0.494185
O  -6.661781 -1.91439 1.501415
N  -3.697096 -0.030356 -0.659003
N  -0.891504 0.635181 1.043642
N  -5.910903 -0.153989 0.157518
N  -1.09734 1.292298 2.105214
N  6.606106 -0.553695 0.295406
N  -1.29103 1.733475 3.190549
C  -0.720181 1.398882 -0.241474
C  -0.310356 0.400119 -1.343802
C  -2.068539 1.935848 -0.790427
C  -2.695806 0.707747 -1.503019
C  0.612259 -0.748266 -0.949984
C  -4.980423 0.565988 -0.596766
C  -3.408308 -1.228709 -0.012584
C  -4.347959 -1.906601 0.72564
C  2.993596 -1.025386 -0.471977
C  -5.708102 -1.391048 0.859403
C  4.240177 -0.30934 -0.216284
C  4.294807 1.219573 -0.216964
C  5.358657 -1.083217 0.031991
C  5.708549 1.701166 0.079851
C  6.751792 0.859953 0.312022
C  7.7780 -1.40388 0.557574
H  0.037605 2.193613 -0.11936
H  0.145275 0.96772 -2.178749
H  -2.730739 2.355649 -0.018244
H  -1.871212 2.725829 -1.536701
H  -3.226925 0.998523 -2.423896
H  0.687701 -1.489785 -1.764013
H  0.269611 -1.25146 -0.030383
H  -2.389492 -1.591186 -0.153339
H  -6.848678 0.256077 0.217465
H  -4.103943 -2.845815 1.221912
H  3.581883 1.632119 0.527695
H  3.946542 1.619636 -1.192215
H  5.269791 -2.174319 0.024785
H  5.895673 2.77985 0.108746
H  7.761997 1.221149 0.524458
H  7.482039 -2.463647 0.510042
H  8.194683 -1.204527 1.562677
H  8.570046 -1.230043 -0.194891
