program: Gaussian 09
title: 000014611
version: EM64L-G09RevD.01
frameworkgroup: C1[X(C15H12O2)]
method: RPBEPBE
basis: SDD
operation: Freq
keyword: #pfreq=noraman
keyword: PBEPBE/SDD
title: #p freq=noraman PBEPBE/SDD
converged: YES YES NO NO
title: Mulliken charges:
elementType: O O C C C C C C C C C C C C C C C H H H H H H H H H H H H
charge: -0.470344 -0.258926 0.144486 0.465763 0.225436 0.105348 -0.319129 -0.270339 -0.332767 -0.405049 -0.374217 -0.386162 -0.259563 -0.203059 -0.239122 -0.238976 -0.235353 0.287474 0.266183 0.292398 0.213304 0.234924 0.237877 0.234529 0.232220 0.227123 0.230207 0.231366 0.364372
chargesum: 0.00000
title: Mulliken charges with hydrogens summed into heavy atoms:
elementType: O O C C C C C C C C C C C C C C C
charge: -0.105971 -0.258926 0.144486 0.465763 0.225436 0.105348 -0.031656 -0.004156 -0.040370 -0.191745 -0.139293 -0.148285 -0.025034 0.029160 -0.011999 -0.008769 -0.003987
polarizability: 3.45791112e+02 5.96629658e+00 1.77774915e+02 4.34869661e-01 7.85695593e-02 6.44769864e+01
1716.lowfreq: -8.1763 -6.4338 -2.4043 -0.0009 -0.0006 -0.0004 7.8745 28.7604 53.8110
frequency: 6.9379 28.7322 53.8059 86.9429 105.8828 148.2572 190.0357 211.6686 248.3998 275.2527 299.2258 364.1537 378.2422 403.1743 432.4184 448.2567 494.1292 525.1367 535.3360 544.1713 568.0057 614.7710 640.1901 666.2467 695.2907 746.7966 762.6553 765.5614 783.6809 817.9060 848.9854 855.9061 884.0850 913.1605 935.1485 960.8742 981.1404 987.9484 997.3456 1004.6577 1019.3958 1027.5348 1027.6122 1055.6355 1079.7338 1083.8740 1156.2222 1172.7820 1173.6020 1190.5512 1202.3472 1219.6929 1237.7621 1287.8462 1299.2494 1331.6435 1338.1503 1386.5618 1390.5682 1426.9612 1440.2619 1479.9364 1484.6307 1509.2032 1579.8324 1591.1540 1608.3649 1610.3813 1634.2914 3097.4894 3105.7257 3123.6752 3128.8596 3140.6002 3141.4725 3152.2462 3152.8453 3166.5304 3170.3835 3189.0619 3569.4256
redmass: 5.1960 4.4000 5.4205 5.8318 3.7851 3.5612 5.1492 6.9591 3.8995 3.1395 7.1938 7.1319 1.1463 2.7655 3.3953 5.1648 2.8747 3.5349 6.1807 5.7390 6.4713 6.4274 6.4752 3.7649 1.7175 2.5562 1.3357 6.6031 2.2668 6.1296 1.2712 1.4568 4.4777 1.6517 1.6527 1.3569 1.3909 6.1777 1.3223 1.3424 3.4687 1.1829 2.4053 2.3293 2.0809 1.6107 1.2529 1.0737 1.0676 1.1297 2.6282 1.9514 1.9040 1.4891 1.8953 1.3812 1.6809 6.9606 6.2846 2.5414 2.3091 2.4292 2.3355 8.6732 5.6230 6.4512 6.0347 6.2748 5.3236 1.0892 1.0891 1.0858 1.0873 1.0878 1.0917 1.0964 1.0927 1.1016 1.1002 1.0911 1.0657
irintensity: 0.3592 1.7183 0.6490 0.4383 0.0063 0.0151 1.7487 0.8010 3.4323 2.1371 5.1917 4.4377 126.2017 0.1945 0.0144 13.9364 19.4629 5.8537 11.4700 11.0142 27.8923 0.2030 5.5286 11.1591 37.1442 4.5124 150.6863 8.4557 14.1760 19.5608 0.1387 0.0723 11.3673 8.0143 0.8956 1.2471 0.1212 3.4723 2.0133 0.4891 29.2287 51.2041 31.7095 5.3580 125.6403 11.4719 38.9024 8.1909 3.4585 10.5281 141.9130 36.5408 5.1760 76.6422 28.6463 15.9997 190.3266 28.4834 17.0160 39.9980 45.0871 25.2657 22.6092 232.2626 22.5656 34.2283 88.6802 88.8566 243.5037 1.9947 13.3241 4.6560 0.1380 9.6095 11.9191 38.0216 2.4895 34.0922 35.9177 25.0474 33.1900
temp: 298.150 k
press: 1.00000 atm
elementType: 8 8 6 6 6 6 6 6 6 6 6 6 6 6 6 6 6 1 1 1 1 1 1 1 1 1 1 1 1
symmnumber: 1
zpe: 588530.5 jmol-1
zpe.correction: 0.224159 hartree
zpe.thermalcorrener: 0.238622 hartree
zpe.thermalcorrenthalpy: 0.239566 hartree
zpe.thermalcorrgfe: 0.179699 hartree
zpe.sumelectzpe: -728.050233 hartree
zpe.sumelectthermal: -728.035771 hartree
zpe.sumelectthermalent: -728.034827 hartree
zpe.sumelectthermalfe: -728.094694 hartree
dipole: -0.3681 4.5609 -0.0720
dipole: 4.5763
quadrupole: -70.7950 -88.3201 -106.0437
quadrupole: -8.4288 0.0994 0.4027
quadrupole: 17.5912 0.0662 -17.6574 -8.4288 0.0994 0.4027
hfenergy: -728.2743928 hartree
pointgroup: C01 [X(C15H12O2)]
dipole: 0.2134369 1.5061707 0.9631162 debye
polarizability: 344.0758296|-1.3343504|145.9398105|-20.8884048|51.1473205|98.0273732 unknown
InChI: InChI=1S/C15H12O2/c16-14-9-5-4-8-13(14)15(17)11-10-12-6-2-1-3-7-12/h1-11,16H
charge 0 multiplicity 1
29 atoms
O  1.609216 1.776138 0.729031
O  0.917013 -1.873384 -1.493661
C  2.350895 -0.214895 -0.511695
C  -2.782896 -0.192955 -0.114265
C  2.650574 0.984096 0.204389
C  0.984516 -0.799097 -0.802208
C  3.458389 -0.956963 -1.015774
C  -1.476254 -0.70145 -0.547668
C  -0.247085 -0.148867 -0.291042
C  3.992612 1.400196 0.398065
C  -2.942028 0.998272 0.655668
C  -3.953648 -0.921485 -0.477072
C  4.790885 -0.552933 -0.82926
C  5.060098 0.638709 -0.113784
C  -4.221535 1.437242 1.044664
C  -5.235588 -0.482048 -0.087269
C  -5.375102 0.700185 0.676111
H  3.212461 -1.872219 -1.564539
H  -1.479674 -1.627555 -1.141906
H  -0.127959 0.768305 0.28751
H  4.196856 2.326113 0.953235
H  -2.059601 1.578042 0.947168
H  -3.845821 -1.838403 -1.069382
H  5.611737 -1.153724 -1.232964
H  6.090939 0.973575 0.04475
H  -4.327173 2.353857 1.635793
H  -6.122223 -1.056898 -0.376266
H  -6.36911 1.04546 0.981437
H  1.981006 2.574086 1.181434
