program: Gaussian 09
title: 000014615
version: EM64L-G09RevD.01
frameworkgroup: C1[X(C14H18N2O)]
method: RPBEPBE
basis: SDD
operation: Freq
keyword: #p
keyword: freq=noraman
keyword: PBEPBE/SDD
title: #p freq=noraman PBEPBE/SDD
converged: YES YES NO NO
title: Mulliken charges:
elementType: O N N C C C C C C C C C C C C C C H H H H H H H H H H H H H H H H H H
charge: -0.238004 -0.122971 -0.062043 -0.448980 -0.315814 -0.300797 0.192951 -0.681743 -0.683483 -0.484047 0.254079 0.284260 -0.360747 -0.348374 -0.239549 -0.229930 -0.234956 0.221369 0.221579 0.188745 0.231747 0.183341 0.207917 0.227704 0.206192 0.213165 0.227147 0.211099 0.213392 0.273236 0.230345 0.269087 0.230088 0.231540 0.232452
chargesum: 0.00000
title: Mulliken charges with hydrogens summed into heavy atoms:
elementType: O N N C C C C C C C C C C C C C C
charge: -0.238004 -0.122971 -0.062043 -0.006032 0.104678 0.090461 0.192951 -0.034681 -0.031844 -0.210810 0.254079 0.284260 -0.130402 -0.079287 -0.009461 0.001610 -0.002504
polarizability: 2.59730105e+02 1.51608384e+01 1.59689226e+02 -1.30506737e+01 8.93228935e+00 1.11270633e+02
1716.lowfreq: -10.6600 -7.9086 -3.7870 -0.0005 -0.0004 -0.0003 19.1314 28.6298 36.3212
frequency: 18.9524 28.4905 36.2272 54.1628 69.6700 79.3036 99.3604 131.2117 189.8488 207.5514 221.9500 236.3750 287.1922 300.8310 330.8956 338.5542 386.0412 399.5981 443.6894 445.9590 482.0292 490.4291 613.4849 616.5875 660.4802 672.6959 695.5934 738.1034 747.8321 775.1756 795.6863 798.1060 829.6479 843.1927 856.0839 905.3691 915.6968 931.4646 969.6556 982.5917 988.2619 989.8806 994.2755 1001.7094 1005.9882 1030.8944 1065.4284 1074.5931 1080.5239 1086.6745 1112.0830 1161.3137 1169.3841 1176.0870 1193.1219 1200.0038 1235.1253 1245.7076 1281.7930 1289.9987 1325.4419 1353.2463 1364.9365 1372.8314 1379.8479 1387.0032 1388.2227 1416.0223 1429.1562 1444.8370 1460.1730 1464.3578 1468.7972 1474.2401 1478.3187 1481.2198 1485.7749 1491.4483 1572.6090 1590.0193 1618.9075 2852.4813 2864.4670 2888.1183 2984.7531 2985.6554 3029.9364 3033.1327 3043.8657 3076.5880 3078.8359 3091.4864 3091.7361 3129.1558 3137.4508 3149.5862 3161.6132 3172.5898 3250.6958
redmass: 3.5061 3.6719 3.5366 4.0084 2.0558 2.5768 3.5027 2.9812 1.5049 2.0252 2.2178 2.4410 2.0649 2.7077 4.3955 3.2100 3.5092 2.8029 3.1233 3.8390 3.3372 3.7128 6.3766 6.1439 4.4904 3.8682 1.9364 3.4875 2.9102 1.7509 1.1966 1.1955 9.0020 1.4668 1.2824 1.9362 8.8428 1.4315 3.9084 1.3846 5.0354 2.4232 2.5609 1.3279 2.9295 1.9326 2.4433 1.8864 1.6333 2.1249 1.9147 1.8394 1.5602 1.1113 1.1179 2.3545 2.3341 2.0956 1.1549 1.2049 1.3631 1.4302 1.3197 1.4180 6.3976 1.2325 1.2359 4.0973 3.4863 2.9152 1.0891 1.0547 1.0504 1.0611 1.0903 2.4030 1.0632 1.0795 6.4203 6.7702 6.1518 1.0724 1.0715 1.0704 1.0357 1.0356 1.0874 1.0871 1.0876 1.0983 1.0975 1.1003 1.1003 1.0850 1.0883 1.0935 1.0966 1.1005 1.0990
irintensity: 0.5664 0.6808 0.8628 3.9204 0.7937 0.0668 0.5130 0.5195 1.8758 0.0764 1.7527 2.4325 0.9226 1.0130 1.7875 2.0450 2.9943 0.0126 3.3451 1.5637 8.1930 2.7081 0.7486 3.0396 3.7583 10.5653 39.2241 7.5114 17.5132 72.5808 10.9903 2.4069 4.4093 23.2165 5.2693 4.2397 7.8166 4.2376 2.1541 0.0828 1.3809 1.9211 10.4230 0.2398 12.1493 12.2733 28.0538 21.5374 7.8242 4.5513 19.6188 14.0385 11.8464 2.8263 0.9375 29.8056 8.8541 8.9966 10.0928 20.4716 1.6284 6.8389 6.1401 4.5838 0.2346 21.1270 22.6709 41.3265 3.9865 13.5798 1.3497 4.8184 8.4455 4.4682 11.1961 55.0019 9.5934 11.3183 41.6744 11.3069 0.8419 58.3590 132.0058 107.7380 30.5234 26.4641 9.7853 12.7414 10.0139 32.5389 86.8868 22.8734 62.4661 2.0229 3.2740 26.4514 21.0387 15.0174 2.5450
temp: 298.150 k
press: 1.00000 atm
elementType: 8 7 7 6 6 6 6 6 6 6 6 6 6 6 6 6 6 1 1 1 1 1 1 1 1 1 1 1 1 1 1 1 1 1 1
symmnumber: 1
zpe: 762488.8 jmol-1
zpe.correction: 0.290417 hartree
zpe.thermalcorrener: 0.307285 hartree
zpe.thermalcorrenthalpy: 0.308230 hartree
zpe.thermalcorrgfe: 0.243084 hartree
zpe.sumelectzpe: -727.693913 hartree
zpe.sumelectthermal: -727.677044 hartree
zpe.sumelectthermalent: -727.676100 hartree
zpe.sumelectthermalfe: -727.741245 hartree
dipole: 0.5848 -3.0192 -0.3729
dipole: 3.0978
quadrupole: -80.8547 -106.0386 -103.2481
quadrupole: 2.6706 -1.7682 1.3369
quadrupole: 15.8591 -9.3248 -6.5343 2.6706 -1.7682 1.3369
hfenergy: -727.9843294 hartree
pointgroup: C01 [X(C14H18N2O1)]
dipole: -0.2339873 1.0508412 -0.5713282 debye
polarizability: 260.0236159|18.1575107|146.8355162|4.5800513|-23.3781449|123.8308325 unknown
InChI: InChI=1S/C14H18N2O/c1-3-16(4-2)11-13-10-14(17-15-13)12-8-6-5-7-9-12/h5-10H,3-4,11H2,1-2H3
charge 0 multiplicity 1
35 atoms
O  0.832156 -1.730378 0.806857
N  -3.304975 0.188998 0.094135
N  -0.597227 -2.073444 0.837423
C  -2.682788 -1.141766 -0.13089
C  -3.302891 0.559347 1.539118
C  -4.654727 0.28565 -0.52769
C  -1.190871 -1.104274 0.096846
C  -3.434283 2.075412 1.772737
C  -4.611355 0.408439 -2.062907
C  -0.250383 -0.143513 -0.407621
C  0.996655 -0.556141 0.046849
C  2.358829 -0.038159 -0.096464
C  2.602587 1.139338 -0.856714
C  3.45427 -0.701894 0.522991
C  3.912295 1.641205 -0.992238
C  4.762236 -0.19507 0.383588
C  4.998235 0.977112 -0.372949
H  -2.866646 -1.433259 -1.18115
H  -3.123526 -1.943545 0.510409
H  -4.106153 0.014101 2.096801
H  -2.340922 0.220468 1.965412
H  -5.300657 -0.581665 -0.234513
H  -5.140848 1.189493 -0.120269
H  -2.625157 2.610282 1.245494
H  -4.399968 2.475688 1.414373
H  -3.361988 2.301749 2.852609
H  -3.995238 1.27601 -2.356994
H  -4.189738 -0.491215 -2.546884
H  -5.632413 0.548844 -2.463541
H  -0.501531 0.728188 -1.004494
H  1.768281 1.659847 -1.339827
H  3.267773 -1.607886 1.107802
H  4.087531 2.548848 -1.579995
H  5.5983 -0.713773 0.865161
H  6.015636 1.369063 -0.479363
