program: Gaussian 09
title: 000122620
version: EM64L-G09RevD.01
frameworkgroup: C1[X(C11H15N5O4)]
method: RPBEPBE
basis: SDD
operation: Freq
keyword: #p
keyword: freq=noraman
keyword: PBEPBE/SDD
title: #p freq=noraman PBEPBE/SDD
converged: YES YES NO NO
title: Mulliken charges:
elementType: O O O O N N N N N C C C C C C C C C C C H H H H H H H H H H H H H H H
charge: -0.524334 -0.529127 -0.500654 -0.223753 -0.231027 -0.432571 -0.015575 -0.062099 -0.620360 -0.137465 -0.124882 -0.523838 -0.074364 -0.129739 -0.411215 0.342209 -0.264336 -0.180657 0.004660 0.135070 0.275567 0.265695 0.246962 0.245673 0.239911 0.237052 0.222382 0.269567 0.412587 0.407891 0.258576 0.377628 0.385163 0.311940 0.347464
chargesum: 0.00000
title: Mulliken charges with hydrogens summed into heavy atoms:
elementType: O O O O N N N N N C C C C C C C C C C C
charge: -0.111747 -0.121235 -0.123026 -0.223753 -0.231027 -0.047408 -0.015575 -0.062099 0.039044 0.138103 0.140813 -0.031203 0.165547 0.107313 0.080734 0.342209 -0.005760 -0.180657 0.004660 0.135070
polarizability: 1.99839885e+02 -3.93514645e+00 1.76673592e+02 -1.94642647e+01 -4.52511684e+00 1.14459379e+02
1716.lowfreq: -2.1511 -0.0002 0.0005 0.0007 4.7133 10.9825 22.2933 37.7702 54.3972
frequency: 21.2354 37.7056 54.3965 103.5943 122.5794 136.8716 158.9833 185.3233 206.3395 241.3169 253.7187 279.4520 316.4502 318.7629 329.7017 342.4452 347.7694 377.2161 400.9153 417.7186 464.8505 479.9478 503.7916 522.0761 531.2465 546.1354 581.1367 626.8662 642.3248 650.2965 660.1753 695.2015 696.6737 718.5219 727.1275 739.3566 770.5593 777.4656 802.4373 808.7094 828.8681 883.7396 911.4408 928.8028 944.3730 951.8396 977.6390 998.9602 1015.0302 1033.6231 1037.5457 1066.1089 1087.7724 1100.0555 1138.8032 1162.7823 1164.6863 1191.2824 1201.0641 1202.8406 1235.9892 1257.2643 1271.2007 1273.2084 1289.5866 1306.2814 1315.3792 1329.4499 1340.6104 1345.8143 1351.9353 1369.4924 1393.0570 1396.2110 1417.8065 1428.3424 1445.5028 1478.8599 1483.5038 1515.7741 1542.2698 1593.9940 1618.0783 1635.5522 2994.3724 2995.3362 3002.0741 3020.5528 3027.1773 3043.2112 3071.4481 3088.1596 3162.5613 3194.8962 3222.1217 3252.4906 3551.6286 3598.4079 3706.9478
redmass: 5.4180 7.1144 6.3559 6.9784 6.8597 5.1715 3.2907 7.4134 6.9467 5.0790 6.5849 4.6300 2.4954 2.3202 2.2846 3.5455 4.6748 2.0649 2.3325 2.1338 6.8311 4.8665 4.8163 1.3290 3.2493 3.7935 5.7484 4.5842 4.5514 8.9248 5.8040 1.2921 7.5924 1.9341 1.5796 2.6298 1.5220 6.8416 2.4158 3.2226 4.6298 1.5810 3.3484 3.6260 3.3778 3.5049 2.8474 2.0028 2.8806 2.5828 2.0265 3.6822 2.8792 2.4796 2.0101 2.9644 1.6036 1.1535 1.9975 1.7715 1.3486 1.5099 1.7733 1.9973 1.3235 1.9522 1.2768 1.2898 1.7007 1.7398 1.4901 1.2777 1.4998 3.9795 1.3909 3.7005 1.2182 1.0875 1.0829 5.9011 2.9524 1.6350 8.8195 3.3565 1.0828 1.0596 1.0851 1.0718 1.0853 1.0873 1.1062 1.0981 1.0741 1.0730 1.0675 1.0959 1.0448 1.0668 1.1053
irintensity: 2.5290 0.5965 10.6059 8.1358 0.0465 7.3284 5.4195 1.9121 16.5879 11.3173 4.1616 0.3017 54.5065 49.8763 49.5843 12.7931 14.2765 21.8189 50.5866 58.2965 6.8538 5.9701 1.9865 99.8921 92.0160 23.4041 2.3420 20.6632 4.3047 2.7199 26.1995 106.7076 8.3415 54.9416 39.5913 12.7851 120.1598 3.0427 22.4019 11.1452 5.6789 62.0431 16.7537 38.9550 6.4248 37.7705 46.2719 41.8537 35.6467 6.0321 7.9741 99.3038 7.9112 14.0516 51.5840 20.9459 30.2035 14.1661 8.2864 18.6302 2.1546 20.1992 7.7272 3.7522 34.1812 14.3127 11.0624 10.5927 48.4876 57.7856 8.5162 24.3003 64.7111 91.9050 29.9241 49.0996 154.6684 4.5915 31.3181 303.0104 183.8193 46.1006 618.8464 359.6607 4.4609 31.3415 10.1425 14.6321 59.6481 65.8890 43.0213 13.3517 741.8818 394.5469 80.3429 1.7932 90.6421 20.0830 42.4524
temp: 298.150 k
press: 1.00000 atm
elementType: 8 8 8 8 7 7 7 7 7 6 6 6 6 6 6 6 6 6 6 6 1 1 1 1 1 1 1 1 1 1 1 1 1 1 1
symmnumber: 1
zpe: 717706.8 jmol-1
zpe.correction: 0.273360 hartree
zpe.thermalcorrener: 0.290673 hartree
zpe.thermalcorrenthalpy: 0.291617 hartree
zpe.thermalcorrgfe: 0.228008 hartree
zpe.sumelectzpe: -1001.309125 hartree
zpe.sumelectthermal: -1001.291812 hartree
zpe.sumelectthermalent: -1001.290867 hartree
zpe.sumelectthermalfe: -1001.354477 hartree
dipole: 11.7631 5.4147 -2.7744
dipole: 13.2433
quadrupole: -136.7292 -119.4764 -108.3668
quadrupole: -38.2343 4.1175 -3.6717
quadrupole: -15.2051 2.0477 13.1573 -38.2343 4.1175 -3.6717
hfenergy: -1001.5824847 hartree
pointgroup: C01 [X(C11H15N5O4)]
dipole: 4.374787 2.5456613 1.2362424 debye
polarizability: 198.2756133|17.2166226|143.5063086|-15.5823704|30.3023723|149.1909348 unknown
InChI: InChI=1S/C11H15N5O4/c12-11-14-9-6(10(20)15-11)13-3-16(9)5-1-4(2-17)7(18)8(5)19/h3-5,7-8,14,17-19H,1-2,12H2
charge 0 multiplicity 1
35 atoms
O  0.740829 1.358869 1.783031
O  2.761049 -0.086367 1.886125
O  4.199459 -1.624108 0.358886
O  -3.647438 -2.11226 -1.522097
N  0.311919 0.370949 -1.005936
N  -1.56183 0.811975 0.601166
N  -0.759947 -1.224592 -2.282361
N  -3.574916 -0.482977 0.175288
N  -3.487042 1.047354 1.945713
C  1.220823 1.525614 -0.751989
C  3.498654 0.535813 -0.480598
C  2.603246 1.372594 -1.443453
C  1.671335 1.760017 0.741912
C  3.037831 0.998228 0.940827
C  3.353656 -0.983248 -0.68943
C  -0.969617 0.178979 -0.477688
C  0.359762 -0.512769 -2.128169
C  -1.618305 -0.798437 -1.249404
C  -2.998732 -1.213875 -0.919246
C  -2.890777 0.421544 0.864259
H  0.699298 2.430392 -1.12032
H  4.564766 0.781445 -0.632232
H  3.035059 2.386177 -1.538259
H  2.548077 0.967648 -2.466544
H  1.839292 2.84777 0.844846
H  3.788977 1.673014 1.391019
H  3.725782 -1.264431 -1.692927
H  2.308236 -1.320943 -0.574281
H  1.173188 0.542244 2.199232
H  3.345591 -0.873815 1.645871
H  1.223794 -0.583731 -2.781297
H  4.246673 -2.601135 0.216817
H  -0.917116 1.249457 1.295211
H  -3.075596 1.852641 2.40976
H  -4.438581 0.761062 2.161867
