program: Gaussian 09
title: 000122500
version: EM64L-G09RevD.01
frameworkgroup: C1[X(C17H26O2)]
method: RPBEPBE
basis: SDD
operation: Freq
keyword: #pfreq=noraman
keyword: PBEPBE/SDD
title: #p freq=noraman PBEPBE/SDD
converged: YES YES NO NO
title: Mulliken charges:
elementType: O O C C C C C C C C C C C C C C C C C H H H H H H H H H H H H H H H H H H H H H H H H H H
charge: -0.262505 -0.264547 -0.353083 -0.387593 -0.356639 -0.569870 -0.355265 0.506922 -0.695525 -0.442448 -0.410036 0.500463 -0.413459 -0.399251 -0.349547 -0.163856 -0.064393 -0.502750 -0.511286 0.189908 0.188597 0.210469 0.209174 0.189985 0.189606 0.206885 0.206799 0.194959 0.195222 0.232425 0.231427 0.210035 0.210263 0.215680 0.224034 0.227232 0.216168 0.253266 0.169772 0.231864 0.244079 0.193301 0.226401 0.193371 0.233748
chargesum: 0.00000
title: Mulliken charges with hydrogens summed into heavy atoms:
elementType: O O C C C C C C C C C C C C C C C C C
charge: -0.262505 -0.264547 0.025423 0.032049 0.022951 -0.156186 0.034917 0.506922 -0.059548 -0.210023 -0.178610 0.500463 -0.189425 -0.172019 -0.133378 0.089410 0.105379 0.166494 0.142233
polarizability: 3.22509153e+02 -2.05954216e+01 1.47414018e+02 6.59257777e+00 -7.05705898e+00 1.66080045e+02
1716.lowfreq: -0.0012 -0.0005 0.0009 2.0068 6.0342 6.8697 20.7045 24.0320 31.0997
frequency: 18.2995 23.7660 30.9842 50.1366 52.8572 64.4563 80.1697 81.5792 92.3442 116.9533 122.3214 133.4602 142.6170 164.6728 187.3444 191.5018 225.0034 234.5357 246.9360 261.9834 298.3312 314.9900 333.7573 387.3196 397.8262 403.8966 427.5745 455.0787 507.9160 535.2290 559.2013 600.1660 639.2799 722.6856 734.6661 739.1946 778.4458 789.3272 805.0714 835.7935 844.8862 852.2177 876.4519 888.6168 890.4468 928.8255 955.4162 974.0579 976.7114 983.6414 999.8102 1009.0757 1011.7872 1015.6604 1056.8663 1065.3944 1073.4663 1080.7523 1109.0469 1114.1898 1115.0277 1121.7120 1131.2765 1146.0345 1163.3337 1191.3787 1191.6300 1219.6942 1226.5447 1228.7614 1240.8338 1252.4704 1275.6127 1283.0880 1285.9545 1290.9229 1293.0437 1306.3572 1321.6457 1326.2479 1346.3080 1349.7408 1355.2859 1386.4430 1393.0493 1416.9327 1426.1104 1430.8042 1453.8955 1454.8660 1462.9834 1463.2305 1469.0020 1476.4809 1478.9825 1479.4883 1481.1269 1484.4859 1489.0764 1507.7526 1572.9589 1621.2282 1664.7070 2855.9612 2929.4541 2950.3762 2950.6542 2955.8403 2966.5197 2968.6562 2972.3278 2976.7927 2987.2086 3001.6639 3013.3187 3016.0647 3030.8122 3047.6101 3062.4636 3068.2106 3068.8601 3070.8313 3104.5959 3110.1025 3115.1271 3122.0688 3134.0381 3137.7054 3147.3202
redmass: 3.9190 4.4244 3.6739 1.5694 4.0270 3.4637 3.0272 2.8440 3.0019 1.9640 1.8998 2.9989 2.1094 1.5593 1.7923 1.6706 2.8536 1.1224 3.2846 3.8028 3.3513 2.7631 3.5194 3.3187 3.1719 2.8360 3.2653 4.1177 4.7485 3.7050 3.1434 3.6871 6.5786 1.0649 2.8830 1.1761 3.5083 1.1949 2.6304 3.9598 1.3393 2.2051 1.2661 2.4956 1.9842 4.9662 1.3397 1.3659 1.2242 1.1909 9.7643 3.6720 3.2214 3.1645 3.5838 2.7647 1.4077 2.2332 1.2678 1.2727 2.3961 2.0531 1.4576 1.4569 1.5848 1.1430 1.6582 1.7152 2.0648 1.5390 1.3550 1.5323 1.1435 1.3571 1.1029 1.2845 1.1815 1.1520 1.3210 1.3905 1.5209 1.6051 1.6653 3.4802 1.2180 2.8914 1.1690 1.1358 1.0527 1.0531 1.0797 1.0684 1.0797 1.0785 1.0420 1.0537 1.0525 1.0854 1.0938 2.6755 6.3964 6.3216 6.1823 1.0834 1.0367 1.0398 1.0588 1.0589 1.0590 1.0592 1.0367 1.0594 1.0974 1.1002 1.0988 1.1018 1.1042 1.1046 1.0923 1.0895 1.1007 1.0993 1.0979 1.0869 1.0879 1.1030 1.0961 1.0912 1.0950
irintensity: 0.6060 0.0055 0.7744 0.0252 0.5169 1.2778 3.2779 1.2919 2.6951 6.1492 1.9900 0.4485 0.0879 1.3217 2.8139 1.9552 5.2880 0.0098 8.1292 4.7259 0.7802 2.1157 4.2013 1.1543 7.2798 0.0026 1.8423 2.6680 8.9094 17.0697 22.3221 6.1244 0.4692 11.2473 4.1669 0.5801 11.6287 1.5415 10.5767 0.7543 0.2015 112.1276 3.2712 26.5835 9.1099 14.1981 10.8605 0.0827 0.8578 62.4552 112.3370 0.8517 0.4172 1.6701 119.6414 1.6551 10.2597 1.3622 2.0483 2.2720 37.3869 109.6172 44.5293 26.1530 1.4164 2.9063 0.6153 1.8644 2.0469 10.7526 0.2896 5.6675 0.3817 0.5016 0.3847 7.9135 3.8922 17.4642 4.6624 6.0343 3.0073 44.9542 1.2260 17.8381 11.2370 5.7248 8.9969 4.0131 12.6131 3.5088 0.0145 0.1019 1.0658 0.5624 12.3753 15.3461 14.2509 2.6863 25.2080 42.9774 2.4343 12.7545 28.8010 70.8586 70.3330 97.7190 4.6230 8.9528 28.6276 31.7855 37.3401 119.2653 0.9374 0.8884 60.0736 1.9410 18.8828 96.8716 48.0222 25.7647 95.2893 56.6183 31.2232 14.4976 23.9156 24.4389 29.7724 10.5459 9.2199
temp: 298.150 k
press: 1.00000 atm
elementType: 8 8 6 6 6 6 6 6 6 6 6 6 6 6 6 6 6 6 6 1 1 1 1 1 1 1 1 1 1 1 1 1 1 1 1 1 1 1 1 1 1 1 1 1 1
symmnumber: 1
zpe: 1020032.3 jmol-1
zpe.correction: 0.388510 hartree
zpe.thermalcorrener: 0.410725 hartree
zpe.thermalcorrenthalpy: 0.411669 hartree
zpe.thermalcorrgfe: 0.333833 hartree
zpe.sumelectzpe: -812.330797 hartree
zpe.sumelectthermal: -812.308583 hartree
zpe.sumelectthermalent: -812.307638 hartree
zpe.sumelectthermalfe: -812.385475 hartree
dipole: 0.9870 0.1120 2.4051
dipole: 2.6021
quadrupole: -104.6250 -120.8681 -110.9539
quadrupole: -2.1011 -12.9927 0.1087
quadrupole: 7.5240 -8.7191 1.1951 -2.1011 -12.9927 0.1087
hfenergy: -812.7193072 hartree
pointgroup: C01[X(C17H26O2)]
dipole: 0.3916883 -0.0480416 -0.9446346 debye
polarizability: 322.4907147|20.8549009|147.4093466|-6.1354061|-6.9037767|166.1031552 unknown
InChI: InChI=1S/C17H26O2/c1-4-5-6-7-8-15-9-11-16(12-10-15)13-14-17(18-2)19-3/h9-14,17H,4-8H2,1-3H3
charge 0 multiplicity 1
45 atoms
O  -5.900691 0.248451 1.081295
O  -5.372876 -1.804447 0.069085
C  5.335007 0.375982 0.185916
C  3.820536 0.121538 0.01953
C  6.177145 -0.919459 0.159594
C  2.982702 1.430863 0.055923
C  7.693479 -0.665594 0.323039
C  1.49076 1.180956 -0.094125
C  8.528166 -1.964342 0.297806
C  0.831774 1.357948 -1.336474
C  0.715314 0.725993 1.007961
C  -1.322526 0.633804 -0.371565
C  -0.546251 1.0898 -1.472702
C  -0.658922 0.457041 0.877065
C  -2.762213 0.375834 -0.566165
C  -3.657165 -0.057505 0.36634
C  -5.097308 -0.339298 0.048937
C  -7.348263 0.11096 0.853267
C  -4.924113 -2.483642 -1.147958
H  5.683508 1.056542 -0.6193
H  5.513996 0.910741 1.142594
H  3.631366 -0.403115 -0.938641
H  3.466563 -0.558257 0.820911
H  5.997821 -1.456051 -0.795533
H  5.831896 -1.599311 0.966465
H  3.185233 1.94916 1.014905
H  3.336839 2.102253 -0.750686
H  8.037889 0.012661 -0.484302
H  7.871633 -0.128195 1.276918
H  1.403852 1.713543 -2.202412
H  1.201228 0.589572 1.982542
H  8.389394 -2.505801 -0.657124
H  8.225749 -2.645702 1.115457
H  9.607617 -1.755449 0.414035
H  -1.034737 1.240341 -2.443982
H  -1.224388 0.114145 1.750591
H  -3.136493 0.570877 -1.584176
H  -3.374987 -0.269908 1.404309
H  -5.385021 0.044035 -0.964296
H  -7.830147 0.651541 1.681981
H  -7.645881 -0.951709 0.861388
H  -7.641974 0.572457 -0.113272
H  -3.822371 -2.43643 -1.260933
H  -5.397522 -2.049113 -2.05549
H  -5.236017 -3.534408 -1.041016
