program: Gaussian 09
title: 000122512
version: EM64L-G09RevD.01
frameworkgroup: C1[X(C11H16O2)]
method: RPBEPBE
basis: SDD
operation: Freq
keyword: #pfreq=noraman
keyword: PBEPBE/SDD
title: #p freq=noraman PBEPBE/SDD
converged: YES YES NO NO
title: Mulliken charges:
elementType: O O C C C C C C C C C C C H H H H H H H H H H H H H H H H
charge: -0.230851 -0.237171 -0.127046 -0.478383 -0.475317 -0.515390 0.488259 -0.409677 0.486415 -0.503019 -0.829150 -0.730535 0.020084 0.204200 0.224119 0.210209 0.229911 0.210073 0.212883 0.232016 0.214950 0.243644 0.243837 0.222742 0.226237 0.228465 0.214492 0.215587 0.208418
chargesum: 0.00000
title: Mulliken charges with hydrogens summed into heavy atoms:
elementType: O O C C C C C C C C C C C
charge: -0.230851 -0.237171 0.077154 -0.044056 -0.035334 -0.070491 0.488259 -0.194728 0.486415 -0.015539 -0.151707 -0.300455 0.228502
polarizability: 1.68059018e+02 1.57405182e+01 1.17051577e+02 -2.71865381e+00 2.92210539e+00 8.71630009e+01
1716.lowfreq: -21.7384 -12.1354 -7.8433 -5.5242 0.0004 0.0005 0.0007 11.7767 39.9833
frequency: -11.8072 -2.4285 39.9234 70.9371 132.0600 150.3532 164.2379 189.4029 204.1401 282.0357 303.7913 311.8064 334.0393 375.0060 432.5517 446.5607 487.9712 522.9831 545.9980 642.4777 695.6862 727.0330 778.5483 793.7536 798.8436 844.7435 890.1525 918.6309 924.0148 925.2631 953.0931 956.3403 989.6290 991.4119 1015.9826 1047.6118 1063.9589 1073.1677 1083.7269 1125.6213 1138.3008 1180.4602 1195.5990 1211.5512 1230.3145 1256.8942 1286.3946 1301.4255 1312.9993 1325.8040 1330.2179 1348.2264 1366.5571 1378.1704 1392.6906 1426.6901 1451.2015 1457.4155 1462.5129 1464.0717 1470.0860 1477.1289 1619.1933 1664.9382 1690.0025 2938.5628 2958.3025 2964.6245 2965.7876 2987.2062 2999.3342 3010.7482 3016.8272 3029.7804 3038.3947 3053.5083 3072.1444 3086.0658 3093.8922 3097.4587 3195.0050
redmass: 3.7525 4.4689 4.4009 3.2962 4.1015 1.5234 1.4732 6.7485 2.4924 2.9640 3.1137 2.7045 2.2855 2.4107 2.5461 2.2650 2.6776 3.0515 2.8525 4.6376 1.2205 3.2972 3.0054 2.9611 1.4833 2.1604 2.7056 1.5661 1.9713 1.3641 2.0665 1.6381 2.0489 1.5273 1.6714 1.6428 2.1702 2.0036 7.6981 1.9333 1.3890 1.6821 1.0889 1.4482 1.5052 1.4626 1.3388 1.5568 1.2873 1.4206 1.2514 1.2593 2.1139 1.7961 1.2361 1.1809 1.0935 1.0795 1.0571 1.0971 1.0817 1.0640 8.7101 4.8396 6.9835 1.0809 1.0630 1.0597 1.0379 1.0670 1.0583 1.0941 1.0958 1.0912 1.0964 1.1012 1.1059 1.0981 1.0910 1.0629 1.1128
irintensity: 1.1138 0.8812 0.2852 1.2283 0.5651 0.5939 0.2549 6.3062 0.7360 1.1985 9.8824 2.8577 17.1951 6.0053 2.8561 1.6502 4.3203 3.1822 2.1564 3.4040 0.0887 4.8234 16.6240 43.2872 4.1305 10.6731 0.2576 4.1820 16.1132 56.8953 1.2837 4.4223 14.6638 1.7520 4.9303 1.2652 8.7855 0.2546 396.2458 1.9825 8.1130 1.7190 8.8515 0.2213 9.0267 4.1725 3.1716 11.6043 10.6702 4.0977 10.0423 6.5677 0.4412 2.0703 22.4066 2.8315 6.3361 13.6733 11.1253 12.1696 9.1417 25.5379 352.1571 32.3175 3.3513 9.8617 24.6848 35.4135 35.3360 21.5213 13.2328 29.1635 30.3506 59.5129 29.7239 48.2158 15.6298 32.3511 37.0125 8.7769 28.8003
temp: 298.150 k
press: 1.00000 atm
elementType: 8 8 6 6 6 6 6 6 6 6 6 6 6 1 1 1 1 1 1 1 1 1 1 1 1 1 1 1 1
symmnumber: 1
zpe: 641078.6 jmol-1
zpe.correction: 0.244174 hartree
zpe.thermalcorrener: 0.256321 hartree
zpe.thermalcorrenthalpy: 0.257265 hartree
zpe.thermalcorrgfe: 0.205538 hartree
zpe.sumelectzpe: -578.171787 hartree
zpe.sumelectthermal: -578.159640 hartree
zpe.sumelectthermalent: -578.158696 hartree
zpe.sumelectthermalfe: -578.210423 hartree
dipole: 2.4223 -0.4764 -0.6286
dipole: 2.5475
quadrupole: -95.4546 -73.1815 -79.7165
quadrupole: 0.8160 4.8170 0.6142
quadrupole: -12.6704 9.6027 3.0677 0.8160 4.8170 0.6142
hfenergy: -578.4159605 hartree
pointgroup: C01 [X(C11H16O2)]
dipole: -0.9568085 -0.1032489 0.2799773 debye
polarizability: 167.0317148|-17.5628252|115.6327424|0.3652071|-8.7231399|89.6091388 unknown
InChI: InChI=1S/C11H16O2/c1-9(2)11-5-3-10(4-6-11)7-13-8-12/h3,8,11H,1,4-7H2,2H3
charge 0 multiplicity 1
29 atoms
O  2.990675 -0.354167 0.765151
O  5.080997 -0.374545 -0.300699
C  -1.925667 0.059686 0.253463
C  -1.225349 -0.926383 -0.732023
C  -1.365951 1.48147 0.010867
C  0.29536 -0.991708 -0.46223
C  0.911194 0.387325 -0.271656
C  0.148348 1.496228 -0.062402
C  -3.451041 -0.05321 0.187237
C  2.408736 0.489682 -0.353159
C  -4.036658 -1.288375 0.855741
C  -4.257851 0.865233 -0.409703
C  4.325407 -0.698335 0.638134
H  -1.618998 -0.24697 1.278621
H  -1.413184 -0.576034 -1.766118
H  -1.661465 -1.939013 -0.649269
H  -1.709485 2.165417 0.811728
H  -1.773961 1.896386 -0.935195
H  0.805963 -1.513065 -1.297804
H  0.499375 -1.60259 0.440848
H  0.641363 2.472109 0.059276
H  2.771992 1.522493 -0.211145
H  2.820323 0.092811 -1.300752
H  -3.607643 -2.220477 0.439807
H  -3.808656 -1.290754 1.940146
H  -5.132343 -1.336427 0.736353
H  -5.34554 0.730126 -0.437646
H  -3.873198 1.776086 -0.880199
H  4.611555 -1.311997 1.514029
