program: Gaussian 09
title: 000122486
version: EM64L-G09RevD.01
frameworkgroup: C1[X(C14H18O3)]
method: RPBEPBE
basis: SDD
operation: Freq
keyword: #pfreq=noraman
keyword: PBEPBE/SDD
title: #p freq=noraman PBEPBE/SDD
converged: YES YES NO NO
title: Mulliken charges:
elementType: O O O C C C C C C C C C C C C C C H H H H H H H H H H H H H H H H H H
charge: -0.196682 -0.154247 -0.153342 -0.307619 -0.241498 -0.583055 -0.471239 0.567924 -0.422489 0.170552 0.166449 -0.614339 -0.453385 -0.281210 0.378393 -0.782238 -0.795301 0.292333 0.289192 0.244921 0.249666 0.258633 0.218958 0.225296 0.210732 0.219191 0.209127 0.213713 0.205571 0.223361 0.225831 0.215518 0.225864 0.225690 0.219729
chargesum: 0.00000
title: Mulliken charges with hydrogens summed into heavy atoms:
elementType: O O O C C C C C C C C C C C C C C
charge: -0.196682 -0.154247 -0.153342 -0.015286 0.047694 -0.088468 0.006353 0.567924 -0.197193 0.170552 0.166449 -0.184416 -0.030546 -0.075639 0.378393 -0.117527 -0.124019
polarizability: 1.39681206e+02 2.19700006e+00 1.53595680e+02 1.89653820e+00 -1.71468960e+00 1.57945192e+02
1716.lowfreq: -10.1034 -5.3552 0.0006 0.0006 0.0007 7.3775 16.0157 22.8529 36.9239
frequency: 15.4016 22.0925 36.9091 52.4490 95.1307 123.1766 128.0115 140.9161 144.2300 187.2546 206.4082 222.1492 262.0928 287.7498 332.2190 348.9858 378.8397 403.7746 412.8415 441.6787 463.0185 493.9061 506.2190 546.7383 571.5128 602.2673 651.2887 675.8226 719.8261 757.8813 774.1611 795.1627 808.6205 832.3122 840.8942 873.1286 906.9186 927.2682 943.4587 949.6969 959.8615 974.4560 994.3093 1012.4784 1025.7834 1047.6957 1081.8879 1082.4026 1105.9490 1113.9996 1143.8176 1152.9090 1173.3320 1179.6219 1198.5291 1211.7949 1230.7566 1232.3893 1263.8124 1285.9763 1304.7600 1316.4366 1323.6769 1333.7397 1347.3550 1361.1662 1363.1156 1389.7437 1401.0408 1454.2818 1456.9292 1461.8605 1466.7605 1469.5849 1472.8972 1473.5348 1478.6746 1695.5436 1700.6275 1704.7104 1772.6562 2952.5956 2959.7017 2964.2145 2964.8651 2968.9658 2970.2327 2979.1458 3017.5246 3021.0559 3031.1015 3031.4486 3033.9058 3041.1162 3068.3363 3079.1218 3080.9996 3088.1052 3107.8655
redmass: 4.7935 5.1004 3.1294 3.7101 4.1125 1.2881 2.3874 5.0099 2.4513 1.4971 3.7577 2.9568 2.3270 2.2335 4.3070 2.9230 2.3184 3.3631 2.7450 5.6908 2.4859 2.8407 4.3001 2.9240 6.5839 6.2245 4.5086 7.5274 4.4473 2.6566 2.1302 4.1023 1.8056 1.4725 3.6046 3.0708 2.0666 2.0972 2.5923 1.4784 1.9899 2.5483 1.2588 2.3204 2.2050 2.1677 2.4112 1.7284 1.6181 6.7340 1.6711 1.7089 1.5241 1.4865 1.1665 1.1832 1.5679 1.9125 1.4132 1.4091 1.4105 1.2872 1.4695 1.5209 1.5386 1.6819 1.6246 1.2889 1.2278 1.0531 1.0787 1.0901 1.0795 1.0588 1.0728 1.0639 1.0818 6.4754 7.1925 12.2708 12.5421 1.0626 1.0373 1.0501 1.0533 1.0648 1.0696 1.0744 1.0980 1.0967 1.0964 1.0961 1.0964 1.0948 1.0908 1.0875 1.0972 1.0961 1.0910
irintensity: 1.1285 0.8658 0.0217 1.0468 0.8005 1.1756 1.4059 0.3194 6.8642 0.5939 2.9320 2.2567 3.0351 0.1551 3.0542 3.1404 1.0162 4.0601 3.0588 1.8411 4.9337 2.4719 16.1170 14.3197 4.0067 2.2659 9.9429 16.4616 8.6145 11.9213 8.8095 156.4376 30.3030 22.0233 74.3214 6.5950 9.2894 6.9169 38.6759 2.9215 9.1422 8.6990 4.1632 4.6241 34.7809 6.8594 23.4344 5.2034 17.7993 115.1623 1.8873 4.9704 1.8910 6.2630 6.9577 2.0220 1.1940 3.9372 6.6453 1.6480 0.6019 2.4131 2.1366 3.6705 2.5647 2.0863 2.3324 25.8493 11.8631 1.6792 17.5669 7.9226 8.0714 14.4723 32.6274 5.6433 13.0129 4.1467 33.6415 437.0894 89.3726 20.0628 29.9979 52.3150 10.7970 64.3389 21.4173 16.5150 18.2265 3.7888 2.5731 7.9267 57.0003 31.2281 20.1940 9.9839 44.2638 38.3371 25.4459
temp: 298.150 k
press: 1.00000 atm
elementType: 8 8 8 6 6 6 6 6 6 6 6 6 6 6 6 6 6 1 1 1 1 1 1 1 1 1 1 1 1 1 1 1 1 1 1
symmnumber: 1
zpe: 756420.1 jmol-1
zpe.correction: 0.288105 hartree
zpe.thermalcorrener: 0.305311 hartree
zpe.thermalcorrenthalpy: 0.306256 hartree
zpe.thermalcorrgfe: 0.240798 hartree
zpe.sumelectzpe: -768.659045 hartree
zpe.sumelectthermal: -768.641839 hartree
zpe.sumelectthermalent: -768.640894 hartree
zpe.sumelectthermalfe: -768.706352 hartree
dipole: 1.9749 4.4678 1.1661
dipole: 5.0220
quadrupole: -103.6430 -104.7157 -107.9727
quadrupole: -11.7204 -7.2523 2.3998
quadrupole: 1.8008 0.7281 -2.5289 -11.7204 -7.2523 2.3998
hfenergy: -768.94715 hartree
pointgroup: C01 [X(C14H18O3)]
dipole: 0.9196119 -1.6896148 -0.4510055 debye
polarizability: 140.1953611|-3.1565987|153.2185889|-2.2419317|-1.977661|157.8081277 unknown
InChI: InChI=1S/C14H18O3/c1-9(2)4-3-5-10-6-7-11-12(8-10)14(16)17-13(11)15/h4,6,11-12H,3,5,7-8H2,1-2H3
charge 0 multiplicity 1
35 atoms
O  -2.762373 1.327093 0.323566
O  -3.104973 0.312208 2.407412
O  -2.161703 1.673932 -1.9126
C  -1.984676 -0.945714 0.543953
C  -2.245187 -0.652401 -0.957898
C  -0.469743 -0.895467 0.910814
C  -1.259714 -1.26842 -1.98017
C  0.391655 -1.674089 -0.072131
C  0.014845 -1.816164 -1.36989
C  -2.690988 0.207792 1.25201
C  -2.343159 0.87795 -0.990095
C  1.703856 -2.222213 0.462081
C  2.647827 -1.128493 1.059951
C  3.071449 -0.095443 0.035444
C  2.99415 1.264502 0.120997
C  3.466078 2.14349 -1.027112
C  2.455209 2.031262 1.31716
H  -2.403448 -1.913024 0.863161
H  -3.272294 -0.999813 -1.196515
H  -0.343277 -1.287199 1.937588
H  -0.122468 0.158742 0.938178
H  -1.012979 -0.495821 -2.737135
H  -1.766249 -2.077811 -2.540685
H  0.673455 -2.360121 -2.060795
H  1.499883 -2.967463 1.260319
H  2.238514 -2.755936 -0.347369
H  2.162344 -0.652262 1.931552
H  3.544309 -1.649826 1.456689
H  3.486365 -0.520531 -0.89305
H  2.637363 2.771306 -1.410825
H  3.860204 1.54584 -1.867315
H  4.262727 2.839295 -0.695924
H  3.244013 2.678861 1.749268
H  1.631472 2.705751 1.009548
H  2.08151 1.38009 2.124518
