program: Gaussian 09
title: 000014594
version: EM64L-G09RevD.01
frameworkgroup: C1[X(C10H10Cl2FNO2)]
method: RPBEPBE
basis: SDD
operation: Freq
keyword: #p
keyword: freq=noraman
keyword: PBEPBE/SDD
title: #p freq=noraman PBEPBE/SDD
converged: YES YES NO NO
title: Mulliken charges:
elementType: Cl Cl F O O N C C C C C C C C C C H H H H H H H H H H
charge: 0.018081 0.052182 -0.204232 -0.385126 -0.263173 -0.344980 -0.684674 0.481493 -0.047574 0.258990 -0.391791 -0.337058 -0.571544 -0.357948 -0.357285 0.314814 0.220885 0.262236 0.281776 0.328441 0.338747 0.235301 0.270814 0.258544 0.258861 0.364218
chargesum: 0.00000
title: Mulliken charges with hydrogens summed into heavy atoms:
elementType: Cl Cl F O O N C C C C C C C C C C
charge: 0.018081 0.052182 -0.204232 -0.020908 -0.263173 -0.016539 -0.201552 0.481493 0.234202 0.258990 -0.156490 -0.066244 -0.232797 -0.099404 -0.098424 0.314814
polarizability: 1.54613863e+02 -1.61476320e+01 1.24041945e+02 -2.77891579e+00 -1.36182349e+01 1.30530781e+02
1716.lowfreq: -4.6713 -0.0025 -0.0024 -0.0007 1.9179 6.9978 11.1588 21.0206 31.1638
frequency: 9.1316 20.9327 31.0196 47.4338 60.1830 84.4943 147.9151 157.0863 199.4606 213.2241 236.0659 268.8392 274.5968 300.2119 344.7150 390.8532 404.5168 412.2484 447.6257 492.7114 517.2954 544.6725 593.5015 629.6197 647.7021 678.1558 693.5981 710.5205 727.7805 777.9412 816.8715 824.3698 850.3458 904.9941 927.2918 947.7408 965.3368 971.1686 1006.4695 1023.4076 1078.7875 1105.0695 1137.1406 1156.3448 1183.9681 1197.5400 1206.6471 1206.8358 1245.2304 1266.4843 1280.3327 1300.4339 1323.6474 1384.0194 1391.2740 1408.2081 1453.2246 1468.9480 1495.2502 1601.2234 1609.2961 1618.8491 3010.9140 3011.6796 3075.3049 3132.2750 3136.8779 3146.1226 3175.0283 3177.6098 3529.9584 3581.2924
redmass: 10.3586 6.0349 6.1065 7.9255 8.9761 10.0537 7.9952 7.8354 13.1662 8.8209 6.6246 1.2930 3.7986 5.9754 5.3829 5.4705 3.2379 2.9739 6.6092 2.7931 3.1154 5.8433 4.7483 6.1870 1.4668 5.3245 5.0019 4.2540 6.4974 4.1217 1.7614 1.8085 2.3486 4.3572 1.7429 1.5147 1.3729 3.3925 2.8459 4.3074 2.3872 1.5843 1.3792 1.4977 1.0606 1.5988 1.3532 2.8666 1.5502 1.2300 1.4207 1.3310 1.6300 6.8310 1.3945 2.8978 1.4690 1.3062 2.5077 7.8390 6.4105 6.6394 1.0614 1.0822 1.1029 1.0903 1.0891 1.0902 1.0955 1.0963 1.0777 1.0667
irintensity: 0.2810 0.2793 0.4918 11.1145 2.4054 1.9261 0.1451 4.6115 1.2047 1.8946 6.6070 103.5619 43.0367 1.9324 3.2978 1.8473 2.9048 0.2700 18.6653 5.1664 46.4288 33.9772 21.8103 3.6669 156.7144 15.5676 16.7786 13.2493 97.4294 29.3010 23.6536 13.1818 37.1016 32.3685 2.5467 0.9005 0.6843 11.0031 14.3480 222.4102 6.4832 19.4847 77.4079 37.6470 12.5266 21.0868 18.9228 13.1713 17.9500 36.0940 15.0818 2.3840 105.9581 0.6632 6.4801 1.4255 243.1464 169.0236 86.9535 3.2490 47.7985 120.2156 14.7156 19.6116 6.7636 11.6500 2.5736 1.9364 2.7796 2.2214 28.9824 23.1262
temp: 298.150 k
press: 1.00000 atm
elementType: 17 17 9 8 8 7 6 6 6 6 6 6 6 6 6 6 1 1 1 1 1 1 1 1 1 1
symmnumber: 1
zpe: 486867.4 jmol-1
zpe.correction: 0.185438 hartree
zpe.thermalcorrener: 0.201549 hartree
zpe.thermalcorrenthalpy: 0.202493 hartree
zpe.thermalcorrgfe: 0.137136 hartree
zpe.sumelectzpe: -1611.042255 hartree
zpe.sumelectthermal: -1611.026145 hartree
zpe.sumelectthermalent: -1611.025201 hartree
zpe.sumelectthermalfe: -1611.090558 hartree
dipole: 1.0738 1.8999 2.1051
dipole: 3.0321
quadrupole: -126.6141 -108.8063 -101.4673
quadrupole: -2.3268 4.5272 3.0046
quadrupole: -14.3182 3.4896 10.8286 -2.3268 4.5272 3.0046
hfenergy: -1611.2276935 hartree
pointgroup: C01 [X(C10H10Cl2F1N1O2)]
dipole: -0.3358515 0.6449952 -0.9456668 debye
dipolederiv: -0.1680347 0.0292241 -0.0517179 0.0438093 -0.3814515 -0.2196006 -0.0947442 -0.2287274 -0.4823434 -0.4775317 0.0805712 -0.3226299 0.1351886 -0.1879343 0.0425876 -0.3441499 0.0440784 -0.4017799 -0.766616 -0.4062925 0.2487203 -0.4714517 -0.4836594 0.1661211 0.2953617 0.1709939 -0.3076447 -0.9614756 -0.1465477 0.0249501 -0.1977125 -0.2466274 0.1438281 0.1191742 0.2060897 -0.5166262 -0.6897397 0.0002368 -0.1197171 0.2289614 -0.7350438 -0.1763211 0.0345569 -0.4199391 -0.5854901 -1.4284992 0.3292599 0.1076373 0.6550425 -0.8397924 0.0960307 -0.2368201 0.1217182 -0.3968015 -0.3549906 -0.051854 -0.144195 -0.1705596 0.0137914 -0.0037111 -0.1621081 -0.042267 0.0738424 0.2267729 0.1438097 -0.058079 0.2837351 0.0389513 -0.0456898 -0.2289256 -0.0817538 -0.126654 1.2317574 0.1026138 -0.1213625 0.1585822 0.3582045 -0.2449215 0.2428535 -0.4779273 0.3143739 1.4673657 -0.4328927 0.155695 -0.8341095 0.9593198 0.3424867 0.0964815 0.64057 0.5610894 -0.1198831 0.0701001 -0.0528469 0.039134 -0.028792 0.0906644 -0.0563886 0.0486801 0.0533343 -0.1057508 0.0471898 -0.0432429 0.0700023 -0.0234138 0.0405661 0.0208903 0.104619 0.0130734 0.5960386 -0.106667 0.4022884 -0.2227575 0.586938 0.278989 0.4580178 0.2353181 0.9824448 -0.1960348 -0.0245782 0.0158123 0.0308879 -0.0587744 0.0320655 0.1378695 0.1463901 -0.1251448 -0.1713187 -0.022145 -0.0098067 -0.1224072 -0.1765059 0.0962496 -0.1120801 -0.0020194 -0.0045565 0.782093 0.4794905 -0.3023915 0.5297301 0.509504 -0.1583254 -0.3403012 -0.1624046 0.3320177 0.0135296 -0.0067689 0.0450557 0.0331165 0.0770211 -0.1068566 0.0476038 -0.0225653 -0.0874328 0.0402166 0.0142286 0.0035431 0.0038958 -0.0702538 0.0456554 0.0092528 -0.0154416 0.083958 0.0974903 -0.0389182 0.0606208 -0.0525323 0.0464046 -0.0749742 -0.0093637 0.0697665 0.0031243 0.2321514 0.0539016 -0.0546409 -0.0318204 0.2722139 -0.1014525 -0.0829818 -0.0754533 0.193615 -0.0439468 -0.0168278 0.0108742 0.0094642 0.012682 -0.0357988 0.0006804 -0.0226133 -0.030495 0.0787617 -0.0087963 0.111687 -0.0091159 0.0999614 -0.0271977 0.0970047 -0.0383535 -0.0424609 0.1346146 -0.0722095 -0.0196453 -0.0521166 0.0368461 -0.0579291 -0.0260162 -0.0543428 0.0742801 0.109416 -0.0718061 0.0026198 -0.0889018 0.036639 -0.0732599 0.000639 -0.0760201 0.0832927 0.0976944 -0.0245418 0.0765685 -0.0267 0.1212104 -0.040239 0.0921772 -0.0354614 0.0082642 0.3759197 0.0802196 0.0342031 0.0586352 0.0625611 -0.0089667 0.0413164 -0.032934 0.3307197 unknown
polarizability: 156.764661|13.0976329|126.2605421|-2.6620353|14.9522139|126.1613867 unknown
InChI: InChI=1S/C10H10Cl2FNO2/c11-9(12)10(16)14-8(15)5-6-1-3-7(13)4-2-6/h1-4,9-10,14,16H,5H2
charge 0 multiplicity 1
26 atoms
Cl 3.16807 -2.193893 -0.807988
Cl 4.486575 -1.282671 1.809298
F  -4.668647 -1.66277 0.851663
O  4.154481 0.75109 -0.52744
O  0.912113 2.357912 0.722979
N  1.736759 0.616204 -0.587292
C  -0.434411 1.630005 -1.203006
C  -1.565729 0.753659 -0.662953
C  2.947304 0.426306 0.210753
C  0.789099 1.589546 -0.276742
C  -2.037864 -0.358533 -1.403337
C  -2.151586 1.041402 0.598144
C  3.049783 -1.036798 0.665346
C  -3.078412 -1.176353 -0.906249
C  -3.190023 0.236657 1.113233
C  -3.629315 -0.856233 0.345068
H  -0.163481 1.313106 -2.226357
H  -0.755418 2.685407 -1.248292
H  2.823586 1.062542 1.110647
H  1.627671 0.026987 -1.417173
H  2.150132 -1.346496 1.211304
H  -1.599653 -0.58985 -2.381296
H  -1.783312 1.893436 1.180052
H  -3.454683 -2.035716 -1.468426
H  -3.652118 0.446037 2.082295
H  4.254479 1.735117 -0.568931
