program: Gaussian 09
title: 000122762
version: EM64L-G09RevD.01
frameworkgroup: C1[X(C14H26N4O9P2)]
method: RPBEPBE
basis: SDD
operation: Freq
keyword: #p
keyword: freq=noraman
keyword: PBEPBE/SDD
title: #p freq=noraman PBEPBE/SDD
converged: NO YES NO NO
title: Mulliken charges:
elementType: P P O O O O O O O O O N N N N C C C C C C C C C C C C C C H H H H H H H H H H H H H H H H H H H H H H H H H H
charge: 1.413382 1.380444 -0.255986 -0.555478 -0.510817 -0.745332 -0.318141 -0.683913 -0.617322 -0.586802 -0.805812 -0.099602 -0.202177 -0.064411 -0.614351 0.059911 -0.511980 -0.517657 -0.048553 -0.324250 -0.316243 -0.583624 -0.581184 -0.601233 -0.324471 -0.036983 0.093968 -0.368505 0.189662 0.234517 0.235826 0.254768 0.262742 0.239160 0.284407 0.245467 0.219550 0.288306 0.251364 0.239382 0.331902 0.231931 0.238154 0.220131 0.368547 0.325449 0.303377 0.217508 0.306143 0.225499 0.264657 0.241261 0.432453 0.345123 0.329833
chargesum: 0.00000
title: Mulliken charges with hydrogens summed into heavy atoms:
elementType: P P O O O O O O O O O N N N N C C C C C C C C C C C C C C
charge: 1.413382 1.380444 -0.255986 -0.555478 -0.510817 -0.745332 -0.318141 -0.251460 -0.617322 -0.586802 -0.805812 -0.099602 -0.202177 -0.064411 0.060605 0.294429 -0.021386 -0.015754 0.235853 0.140767 0.223427 0.219591 0.245648 0.245101 0.207172 0.227674 0.093968 -0.127243 0.189662
polarizability: 2.59535525e+02 -2.30458963e+00 2.75305254e+02 -1.83470107e+01 -1.15407027e+01 2.40094505e+02
1716.lowfreq: -9.2589 -7.9420 -0.0011 -0.0010 0.0006 4.9118 10.1421 22.8447 24.2420
frequency: 9.2632 22.5451 24.2022 39.6102 44.4638 53.6410 66.5248 70.1378 84.7007 90.2320 96.7886 110.9650 121.4835 137.8659 145.0425 167.6008 179.5093 184.5149 205.5368 210.1155 216.0570 234.2097 235.5312 247.5113 252.9094 262.4852 274.6368 294.3621 297.6362 299.5467 303.1014 315.9619 346.0836 350.1216 362.8740 375.6078 393.1647 413.2847 416.7381 422.2768 435.0494 441.8415 449.1599 457.0918 467.4447 471.5509 526.8303 537.6730 542.4385 550.3439 577.5807 581.9172 605.3753 632.7571 672.9190 683.4837 685.8618 696.8363 699.4314 738.3882 748.5869 764.5738 774.5142 777.4830 792.1573 833.1243 835.5372 845.9058 866.3303 907.3308 918.9611 927.4969 927.8644 937.7686 943.4616 965.4525 984.8822 992.4996 998.5363 1004.3629 1021.0918 1032.7649 1044.0077 1055.5156 1065.8258 1069.2271 1078.5378 1083.0411 1089.2427 1119.6996 1129.6784 1136.4576 1141.7220 1177.9278 1204.8606 1207.2020 1215.5755 1219.4306 1234.4689 1237.2137 1261.0020 1266.0564 1272.2683 1284.9298 1301.2992 1315.7402 1323.0899 1334.2835 1348.1380 1379.0052 1381.3169 1383.2969 1386.6423 1393.8804 1424.2548 1435.4157 1440.6002 1457.6478 1460.1805 1460.7207 1467.6412 1476.0398 1477.5874 1482.5803 1487.6179 1494.8359 1495.6706 1502.8509 1512.3444 1520.6016 1582.7207 1629.3989 1640.4399 2213.5601 2959.2635 2975.2536 2986.7294 2988.9225 3000.0822 3015.4363 3018.6555 3023.8481 3041.4726 3044.6291 3051.9419 3074.9667 3084.8228 3097.2448 3099.1769 3116.1038 3119.8959 3124.1684 3130.1268 3132.3499 3148.2745 3173.1512 3195.1078 3538.7677 3693.2940
redmass: 7.1719 5.9328 7.5312 6.3743 6.8900 4.5839 3.9867 3.9090 4.4578 3.6114 5.7746 5.7959 2.9622 6.2126 5.6029 4.4038 3.3097 7.5441 4.6317 6.0859 2.1144 5.9581 4.7046 2.6788 4.0043 1.5398 4.2006 1.2027 2.4347 3.1341 4.7169 5.6843 5.6952 3.2530 2.2713 4.3333 6.3842 3.3494 3.6827 4.3933 2.4503 4.4745 2.4540 8.1272 3.5918 1.1410 3.0362 4.7572 10.9606 5.1452 3.9998 1.4436 6.2454 6.4926 4.8065 3.8290 4.4329 3.2897 7.9440 6.1518 6.0434 15.1818 2.8543 2.1579 4.7537 2.3223 2.3399 4.4571 2.8377 3.4598 2.3593 3.2238 3.7512 2.9848 1.3933 2.9086 3.8860 2.1813 3.8442 1.1546 2.0373 2.0981 3.2828 2.3212 1.3923 4.8127 2.3714 2.9113 4.3750 1.3117 1.8767 1.6252 1.5794 1.5371 1.3369 1.3247 3.1023 1.6061 1.2728 1.4225 1.5323 1.3939 1.4701 1.2918 1.3912 1.3230 1.2685 1.2871 1.5310 1.1960 1.2321 1.3303 1.3617 1.6399 1.1262 1.1247 1.1106 1.0682 1.0800 1.0758 1.1065 1.7635 1.5614 1.0929 1.1313 1.1700 1.0691 1.0781 2.9730 1.0532 3.1395 1.9733 4.2799 1.0763 1.0429 1.0579 1.0826 1.0600 1.0325 1.0328 1.0602 1.0612 1.0638 1.1060 1.1029 1.1046 1.0972 1.1060 1.1034 1.0889 1.1060 1.1044 1.1036 1.1041 1.1074 1.0884 1.1000 1.0456 1.1045
irintensity: 2.5513 4.7759 0.7776 2.6498 1.7953 4.9368 4.3421 2.4257 3.6139 2.1930 5.5845 16.7411 12.7501 2.6898 1.1185 0.8729 5.8675 5.4715 0.7816 2.5135 6.7750 1.5036 4.8872 2.4104 5.4204 3.6643 1.0689 1.1991 7.3978 0.9030 5.2127 12.7645 6.6749 2.3845 1.1974 15.8165 18.4971 21.8187 52.2491 15.2156 0.5157 47.5418 1.8194 22.7269 16.4873 114.7648 10.0871 18.4935 64.7803 3.0085 29.9224 161.0112 78.4951 109.0887 50.4636 31.4295 13.3114 31.5669 206.6501 20.7481 7.3770 44.9252 52.4467 54.5026 22.0920 85.6980 16.2661 161.0136 43.4979 11.7366 33.8212 34.5046 47.4219 83.6524 2.5318 179.7777 23.0243 11.4734 48.4755 171.6644 48.7442 42.8081 68.2710 5.9789 15.0711 117.0220 54.4497 150.8376 137.3757 1.8849 3.7544 3.4304 1.2319 37.2081 3.0651 22.1558 27.6091 3.6502 2.0908 40.9402 0.7988 45.0383 1.9635 4.5229 18.2604 3.1520 1.1711 4.2999 18.4964 150.6483 150.9649 40.3112 22.5139 36.7408 43.7948 7.8817 2.2313 33.4742 6.0231 9.8012 45.6760 125.1267 77.9978 17.7603 8.8084 39.2812 26.2784 12.2956 69.4748 53.2919 305.4022 112.5817 775.1933 972.5655 117.2126 28.1749 30.7637 35.2363 50.2907 29.7128 20.1785 22.7023 25.1213 15.8828 8.6675 6.0787 18.0117 2.0489 25.0816 9.7936 16.2720 2.5812 3.6847 17.5224 17.4523 0.7870 4.5495 128.1749 44.2725
temp: 298.150 k
press: 1.00000 atm
elementType: 15 15 8 8 8 8 8 8 8 8 8 7 7 7 7 6 6 6 6 6 6 6 6 6 6 6 6 6 6 1 1 1 1 1 1 1 1 1 1 1 1 1 1 1 1 1 1 1 1 1 1 1 1 1 1
symmnumber: 1
zpe: 1120126.2 jmol-1
zpe.correction: 0.426634 hartree
zpe.thermalcorrener: 0.457876 hartree
zpe.thermalcorrenthalpy: 0.458821 hartree
zpe.thermalcorrgfe: 0.362812 hartree
zpe.sumelectzpe: -2125.274376 hartree
zpe.sumelectthermal: -2125.243133 hartree
zpe.sumelectthermalent: -2125.242189 hartree
zpe.sumelectthermalfe: -2125.338197 hartree
dipole: -19.5860 -3.5672 -3.3474
dipole: 20.1876
quadrupole: -219.1201 -172.8173 -174.0292
quadrupole: -22.9677 -42.6668 0.2092
quadrupole: -30.4646 15.8382 14.6264 -22.9677 -42.6668 0.2092
hfenergy: -2125.7010093 hartree
pointgroup: C01 [X(C14H26N4O9P2)]
dipole: -7.5742551 1.0898405 2.1271949 debye
polarizability: 264.4514569|8.3078336|254.6865798|15.2258097|-21.371909|255.797248 unknown
InChI: InChI=1S/C14H26N4O9P2/c1-18(2,3)8-9-24-28(20,21)27-29(22,23)25-10-11-4-5-13(26-11)17-7-6-12(15)16-14(17)19/h6-7,11,13,22H,4-5,8-10,15H2,1-3H3
charge 0 multiplicity 1
55 atoms
P  3.630149 -1.306209 0.29694
P  3.659256 0.822699 -2.013755
O  -0.427728 -0.135508 2.167639
O  2.000997 -0.936853 0.865259
O  2.024961 1.26827 -2.487645
O  3.369612 -0.833425 -1.344301
O  -2.304524 2.047773 1.082659
O  4.604304 -0.107676 0.973511
O  4.022047 -2.812689 0.579035
O  4.577541 0.810653 -3.2977
O  3.978825 1.691437 -0.650113
N  0.756761 3.333957 -0.268622
N  -2.726866 -0.238814 1.423099
N  -3.544572 0.925004 -0.554008
N  -4.751141 -0.21157 -2.178826
C  -0.013612 -1.563917 2.006557
C  -0.757065 -2.319417 3.146274
C  -1.906019 -1.352209 3.589233
C  -1.820431 -0.155469 2.613421
C  1.504367 -1.623882 2.065791
C  0.140674 2.345884 -1.294463
C  -0.328867 4.361963 0.046308
C  1.987973 4.04545 -0.833113
C  1.145514 2.610725 1.02207
C  0.895333 1.046408 -1.574299
C  -3.26984 -1.418481 0.957341
C  -2.855244 0.990437 0.640059
C  -3.972774 -1.473558 -0.23003
C  -4.085463 -0.242052 -0.980271
H  -0.342467 -1.912135 1.006322
H  -1.135999 -3.292961 2.790124
H  -0.076081 -2.518234 3.991535
H  -1.706314 -0.965319 4.601332
H  -2.900662 -1.827116 3.621313
H  -2.005392 0.827656 3.067335
H  1.848369 -2.677603 2.069012
H  1.869357 -1.111824 2.977605
H  -0.858637 2.102592 -0.89366
H  0.023195 2.915621 -2.232981
H  -0.617716 4.867421 -0.889403
H  -1.194242 3.836481 0.481868
H  0.081362 5.098932 0.754789
H  1.746165 4.438541 -1.83257
H  2.241368 4.873275 -0.149969
H  2.828761 3.329676 -0.880979
H  0.302111 1.992822 1.363488
H  2.028874 1.986168 0.825783
H  1.395198 3.378081 1.772868
H  1.187077 0.508652 -0.653882
H  0.183796 0.395804 -2.118941
H  -3.126302 -2.310786 1.57056
H  -4.403559 -2.413585 -0.578899
H  4.490299 0.804928 0.407595
H  -4.80612 0.677627 -2.674076
H  -5.168909 -1.044646 -2.58522
