program: Gaussian 09
title: 000122311
version: EM64L-G09RevD.01
frameworkgroup: C1[X(C10H9NO4)]
method: RPBEPBE
basis: SDD
operation: Freq
keyword: #p
keyword: freq=noraman
keyword: PBEPBE/SDD
title: #p freq=noraman PBEPBE/SDD
converged: YES YES NO NO
title: Mulliken charges:
elementType: O O O O N C C C C C C C C C C H H H H H H H H H
charge: -0.331413 -0.425501 -0.470617 -0.238584 -0.454868 0.316023 0.270073 -0.483891 0.272911 -0.537160 -0.478876 0.221367 0.172729 0.073143 -0.520748 0.281786 0.339918 0.257791 0.264567 0.383546 0.244251 0.228719 0.228739 0.386095
chargesum: 0.00000
title: Mulliken charges with hydrogens summed into heavy atoms:
elementType: O O O O N C C C C C C C C C C
charge: -0.331413 -0.041955 -0.084523 -0.238584 -0.114950 0.316023 0.270073 -0.202105 0.272911 -0.279369 -0.214309 0.221367 0.172729 0.073143 0.180961
polarizability: 2.56918808e+02 7.96762282e+00 1.31203280e+02 -1.03133656e-02 2.33589905e-02 5.62828245e+01
1716.lowfreq: -4.7689 -0.0006 -0.0005 0.0004 3.7592 8.9974 61.7802 79.0608 98.5314
frequency: 61.7785 79.0605 98.5290 115.3221 156.3048 186.1215 198.7612 236.5827 291.6714 313.9772 337.1626 349.3579 394.9411 423.0402 469.3685 504.8854 510.8247 515.8737 533.4655 602.6339 609.0190 610.8663 646.1284 674.7719 712.9812 732.6136 738.7656 760.9280 820.7235 843.8390 852.9801 865.1948 927.1566 988.3051 1019.2953 1112.1177 1117.7181 1133.8234 1152.9340 1171.3038 1193.8927 1222.8709 1231.0407 1276.6664 1307.7263 1361.5399 1387.4468 1414.8231 1439.9788 1464.5863 1474.5805 1489.4264 1519.3470 1540.8781 1592.0326 1652.0686 1667.2749 2966.3434 3056.0109 3129.1977 3162.8409 3173.6461 3229.9630 3498.7785 3549.2532 3606.3132
redmass: 4.6030 9.3525 4.5744 6.4532 4.3594 3.7142 2.6320 1.5658 5.6415 9.9877 4.6122 5.1153 8.5062 2.7919 6.3208 5.0480 1.0897 7.1309 1.4063 1.9229 4.0676 1.3830 4.9122 6.6640 4.6088 5.8059 3.3937 6.9926 1.4013 1.6146 2.8839 1.5885 8.3584 5.8851 2.9731 2.1745 1.2566 1.7388 1.3382 1.7825 2.1005 1.6833 1.9705 2.1727 1.7802 6.6765 6.7126 2.7487 1.2937 1.0491 1.0751 4.8566 5.3106 7.2870 5.8840 7.7919 8.6174 1.0325 1.1044 1.1003 1.0918 1.0932 1.0985 1.0644 1.0646 1.0810
irintensity: 5.0425 1.6855 1.8143 2.4100 0.5096 2.8291 0.3873 0.1700 4.6230 3.7470 0.2803 1.2712 0.0128 4.9313 7.0710 52.7420 151.1047 26.9763 108.2033 118.7274 0.0163 10.4232 4.7674 8.8379 43.3604 21.3774 0.0429 3.1215 1.4512 20.1494 20.9679 90.7313 150.7976 14.8163 255.0332 57.5738 0.1184 228.2912 61.4275 254.0311 4.4904 84.5870 33.4416 186.9530 99.3551 183.1535 38.9338 58.6501 9.1792 15.1642 42.6392 5.7739 38.3903 129.7991 44.6537 51.8964 682.7408 57.4436 43.0082 22.3640 8.1459 2.5628 0.1017 148.7171 64.0251 101.4767
temp: 298.150 k
press: 1.00000 atm
elementType: 8 8 8 8 7 6 6 6 6 6 6 6 6 6 6 1 1 1 1 1 1 1 1 1
symmnumber: 1
zpe: 463431.2 jmol-1
zpe.correction: 0.176512 hartree
zpe.thermalcorrener: 0.189679 hartree
zpe.thermalcorrenthalpy: 0.190623 hartree
zpe.thermalcorrgfe: 0.136931 hartree
zpe.sumelectzpe: -741.042695 hartree
zpe.sumelectthermal: -741.029528 hartree
zpe.sumelectthermalent: -741.028583 hartree
zpe.sumelectthermalfe: -741.082276 hartree
dipole: 2.7392 -0.4348 0.0152
dipole: 2.7736
quadrupole: -75.3036 -82.0704 -89.9241
quadrupole: -24.0432 0.0223 0.0024
quadrupole: 7.1291 0.3623 -7.4914 -24.0432 0.0223 0.0024
hfenergy: -741.2192068 hartree
pointgroup: C01 [X(C10H9N1O4)]
dipole: -1.0775251 -0.1614477 -0.0600198 debye
dipolederiv: -1.6062966 -0.4328221 -0.1056532 -0.6812916 -0.6805412 -0.0812956 -0.1445022 -0.074857 -0.3169325 -1.4079057 0.5276463 0.0629361 0.832278 -0.5666225 -0.005968 0.1135392 -0.0133812 -0.4045461 -0.9065479 -0.3856898 -0.0757162 -0.8782705 -0.9476174 -0.104307 -0.1584983 -0.0923729 -0.4710631 -1.3375431 0.3334549 0.0304087 0.6637767 -0.8679605 -0.0724103 0.0845009 -0.0801952 -0.3448929 -0.2366347 -0.0453661 -0.0068851 -0.3743386 -0.4702166 -0.04533 -0.0613938 -0.0370474 -0.2628683 -0.3174874 0.1229461 0.0122335 0.1407333 -0.1998394 -0.0288732 0.0157534 -0.0293669 -0.0089487 0.3241294 0.0189949 0.009457 -0.0457807 0.1252258 0.0113103 -0.0006718 0.0131339 0.0530529 0.648535 -0.2360424 -0.0178008 0.1089611 -0.0336461 0.0318085 0.0397321 0.0226567 -0.2034873 -1.7419416 0.0709315 -0.0319125 -0.1319649 0.3928367 0.0610131 -0.0664527 0.0662036 0.0157149 0.1990423 -0.1152147 -0.0093868 0.0731852 0.0035568 0.034231 0.0222743 0.0295705 -0.1843194 -0.2914973 0.0727392 0.0102841 -0.0983921 -0.0015396 0.033645 -0.018501 0.0380705 -0.2140615 1.1789699 0.3934629 0.0946515 1.0043745 -0.0707269 0.0068078 0.1941424 -0.0087676 0.0390685 0.9676331 -0.4342206 -0.0499939 -1.1487338 0.5170096 0.0460045 -0.1687111 0.0636306 0.0731813 2.9369354 -0.046815 0.0599021 0.0026275 1.4075799 0.1946264 0.0695045 0.1931824 0.2721035 0.4161591 0.1383062 0.0255614 0.5925496 0.6156507 0.0632794 0.1021356 0.0521304 0.3421491 0.0903694 0.0195871 0.0008185 0.0294913 0.0189314 -0.0276275 0.0025248 -0.0276301 0.1848083 0.2439469 0.0316315 0.0029305 0.0712985 0.2373956 -0.0148699 0.0096675 -0.0157586 0.3353748 0.0842291 -0.024872 -0.0063114 -0.0782608 -0.0513548 -0.0394203 -0.0152874 -0.038175 0.1668813 0.07378 -0.0330306 -0.0084428 0.0077289 -0.0301182 -0.0371137 -0.0016573 -0.0381256 0.1883066 0.442446 -0.1380131 -0.02152 -0.0640886 0.3292017 -0.0097453 -0.0096689 -0.0116922 0.3761956 -0.1591741 -0.0492432 -0.0157065 -0.0083385 0.0789387 -0.0081641 -0.008867 -0.009173 0.1241266 0.0858509 0.0845282 -0.0821795 -0.0999965 -0.072285 0.0639177 -0.0443103 0.0972244 -0.0578203 0.0792642 0.0559266 0.114678 -0.1073033 -0.0196442 -0.0565253 0.0172759 -0.0813947 -0.1036349 0.2337378 0.071174 0.0076472 0.1897553 0.2857855 -0.0149936 0.0274714 -0.0178658 0.4016116 unknown
polarizability: 256.7674718|-8.8943343|129.2778984|3.5330518|11.936692|58.3595424 unknown
InChI: InChI=1S/C10H9NO4/c1-15-9-3-5-2-7(10(13)14)11-6(5)4-8(9)12/h2-4,11-13H,1H3
charge 0 multiplicity 1
24 atoms
O  -3.777814 -0.389748 -0.269716
O  -3.243082 2.153987 0.165916
O  4.287226 0.988293 0.159706
O  4.375639 -1.321092 -0.222093
N  1.584261 1.065405 0.103976
C  -0.014058 -0.540337 -0.201707
C  0.210456 0.868392 0.03763
C  1.273351 -1.170222 -0.2761
C  2.238618 -0.166836 -0.084033
C  -1.350658 -1.028975 -0.315558
C  -0.85001 1.79663 0.166089
C  -2.395017 -0.11056 -0.189149
C  -2.150358 1.293392 0.050441
C  3.687978 -0.28203 -0.067167
C  -4.173743 -1.77594 -0.516693
H  1.497248 -2.221491 -0.445599
H  2.079813 1.941376 0.260988
H  -1.537717 -2.091024 -0.497113
H  -0.697238 2.863529 0.346862
H  -4.073206 1.616423 0.054739
H  -5.273046 -1.769121 -0.544215
H  -3.821654 -2.437224 0.298064
H  -3.774897 -2.13193 -1.485998
H  5.274207 0.876505 0.165528
