program: Gaussian 09
title: 000122326
version: EM64L-G09RevD.01
frameworkgroup: C1[X(C10H12N2OS)]
method: RPBEPBE
basis: SDD
operation: Freq
keyword: #p
keyword: freq=noraman
keyword: PBEPBE/SDD
title: #p freq=noraman PBEPBE/SDD
converged: YES YES NO NO
title: Mulliken charges:
elementType: S O N N C C C C C C C C C C H H H H H H H H H H H H
charge: 0.191594 -0.254649 -0.114359 -0.001862 -0.661510 -0.508757 0.275907 0.602622 -0.630538 -0.617780 -0.355338 -0.438121 -0.173049 -0.338662 0.287130 0.292823 0.248631 0.229386 0.230741 0.226889 0.276688 0.247894 0.244266 0.257841 0.234930 0.247283
chargesum: 0.00000
title: Mulliken charges with hydrogens summed into heavy atoms:
elementType: S O N N C C C C C C C C C C
charge: 0.191594 -0.254649 -0.114359 -0.001862 -0.374380 -0.215934 0.275907 0.602622 0.078220 0.133691 -0.111072 -0.180279 0.061881 -0.091379
polarizability: 1.85732577e+02 -1.99427462e+00 1.06403362e+02 1.01892754e+01 2.06994856e+00 1.17572385e+02
1716.lowfreq: -28.5944 -13.0025 -4.5045 -0.0008 0.0006 0.0012 10.2653 22.7117 63.8966
frequency: -19.8218 22.4122 63.8765 87.9123 133.8499 153.9765 221.0516 227.7154 241.8659 250.5902 295.1626 332.8724 342.0394 392.8517 411.7489 451.0708 492.7920 569.5409 597.5322 624.1526 670.5498 697.3190 717.2241 722.2230 778.4509 822.4700 829.3081 924.9284 945.5164 953.5320 987.8029 1002.6050 1009.8403 1027.6091 1046.9225 1070.6835 1112.9216 1121.9837 1132.3520 1164.5314 1193.1081 1204.3297 1209.6920 1242.9497 1282.1823 1286.5184 1317.4488 1343.2155 1375.8248 1387.1181 1418.4272 1426.7817 1453.5052 1464.0930 1471.1204 1479.3200 1487.5299 1561.2226 1583.1311 1613.2505 2978.0100 2989.6464 2991.4495 3046.0139 3064.6582 3094.4100 3101.7796 3105.5208 3123.0443 3125.4475 3137.8029 3167.4467
redmass: 4.0353 4.4216 6.4743 4.6248 2.7418 1.2172 1.1382 3.3160 3.0919 3.9237 3.9791 3.7819 4.6513 3.2231 7.0443 12.7718 5.2704 4.7828 6.9586 6.7624 4.1823 4.4453 3.6364 2.0779 3.7568 3.2436 2.3408 1.3813 1.4965 2.8272 1.4023 3.3611 1.6260 3.0913 1.5869 2.5297 1.6416 1.4962 1.7412 1.2898 1.6159 1.4151 1.7039 3.8896 1.4122 1.8686 3.3064 1.4906 2.1757 1.2798 1.3257 1.6797 2.1609 1.0504 1.0482 1.0534 1.1115 5.5252 5.8101 8.8613 1.0350 1.0848 1.0348 1.0849 1.1011 1.1002 1.1011 1.0998 1.0893 1.0911 1.0909 1.0996
irintensity: 0.8555 1.3033 2.9154 2.9968 0.1127 0.2282 0.5073 1.2054 2.6380 0.2164 4.0156 6.8673 5.6296 6.9620 11.2845 0.7446 0.1097 12.2572 4.7539 6.1706 5.1926 8.3123 5.6277 38.2112 6.8859 20.5130 16.7802 0.8692 1.0425 1.7609 0.4200 6.5206 25.2120 0.2720 24.5054 8.0190 12.3016 2.4113 6.6953 1.7720 0.3771 10.6090 31.4996 40.2933 14.2105 15.2044 4.1799 35.9765 50.5249 47.5000 24.6578 58.2851 12.4547 20.9763 9.5690 17.5555 11.1782 12.3506 3.0299 275.2481 38.0899 32.3913 15.0664 4.4899 24.5029 12.2550 23.9152 0.6580 8.1135 16.7017 11.9754 26.9041
temp: 298.150 k
press: 1.00000 atm
elementType: 16 8 7 7 6 6 6 6 6 6 6 6 6 6 1 1 1 1 1 1 1 1 1 1 1 1
symmnumber: 1
zpe: 534597.9 jmol-1
zpe.correction: 0.203618 hartree
zpe.thermalcorrener: 0.216297 hartree
zpe.thermalcorrenthalpy: 0.217242 hartree
zpe.thermalcorrgfe: 0.163488 hartree
zpe.sumelectzpe: -970.022467 hartree
zpe.sumelectthermal: -970.009787 hartree
zpe.sumelectthermalent: -970.008843 hartree
zpe.sumelectthermalfe: -970.062597 hartree
dipole: -2.3998 0.1031 -3.2399
dipole: 4.0332
quadrupole: -89.0817 -91.7082 -92.3026
quadrupole: -7.3156 5.2958 -4.8023
quadrupole: 1.9492 -0.6773 -1.2718 -7.3156 5.2958 -4.8023
hfenergy: -970.2260847 hartree
pointgroup: C01 [X(C10H12N2O1S1)]
dipole: -0.9123205 0.1884087 -1.2845372 debye
dipolederiv: -0.3950802 0.1257839 -0.0268713 0.0485425 -0.1770342 0.0117076 -0.025854 0.051679 -0.1936047 -0.9901721 -0.0612875 -0.2269236 -0.4247949 -0.6364284 -0.1894021 -0.416815 -0.073672 -0.48648 -1.1335945 0.1293855 -0.2267895 0.2076894 -0.7031079 0.0707973 -0.1979761 -0.017949 -0.3868002 -0.3571105 0.0000398 -0.0086556 -0.0091601 -0.2373731 -0.0014039 0.0344371 -0.0015358 -0.2941953 0.7840953 0.0131755 -0.037305 0.1756962 0.451751 0.0387389 -0.0290347 0.0310207 0.3740582 0.3684198 0.0440222 0.1545572 0.0606035 -0.251092 -0.0505201 0.1636775 -0.0649496 0.2305594 1.4044929 -0.1652889 0.4634169 0.0384908 0.770832 0.1055456 0.6398124 0.0722511 0.347018 0.0506868 -0.0757607 -0.0319505 -0.0976627 -0.0424788 0.0151424 -0.1768465 0.018285 -0.2120369 -0.0331637 0.0066699 -0.0703584 -0.0466126 0.0269963 0.004717 -0.0382411 0.0024023 -0.0520857 0.0556653 -0.1076478 -0.0762524 -0.1099608 0.3956315 -0.1025049 -0.1430926 -0.0606032 0.1814358 0.0155648 0.0157427 -0.0180771 0.0019543 -0.1245612 0.0008186 0.0438985 -0.0142041 0.1596351 0.1314707 0.0127353 0.0255506 -0.0004928 -0.0476217 -0.0182432 0.2036692 -0.0113951 0.1580031 -0.0302931 -0.0030809 0.1013282 -0.0199593 -0.0862291 0.0093482 0.26715 -0.0054386 -0.1385985 0.2462569 0.0215836 -0.0223339 0.0204579 -0.0783442 -0.0119877 -0.2268433 -0.0123797 0.1875658 -0.0505392 0.0140399 -0.0610271 0.0250586 -0.0371982 0.0757406 -0.0440345 0.0395937 -0.1030451 -0.1037566 0.0045567 0.0366525 -0.0246193 0.0580719 0.0021768 -0.0089486 -0.0018596 0.0063429 -0.029825 -0.0319765 -0.091625 -0.06574 0.0923319 -0.0246133 -0.1103215 0.007245 0.0226266 -0.0406845 0.010498 0.1235995 0.0365283 0.0848021 -0.0227073 0.0853205 -0.0017399 0.0246553 0.1083905 0.0248297 0.0077479 0.0644572 -0.1314018 0.0030958 0.0178838 -0.04088 0.0696804 0.1016243 0.0493461 -0.0229562 0.0470335 0.0029081 0.0380723 -0.0025534 0.1346143 -0.1126954 0.0506232 -0.1114018 -0.0435138 0.0016731 0.0851664 -0.0058758 -0.0363093 -0.0583171 0.0990461 -0.0515752 0.1002017 0.0922171 0.0655341 0.0487319 0.0315784 0.1091639 -0.0094674 0.0345444 0.1124481 -0.0085404 0.0581322 0.0056122 0.1288581 0.0087043 0.0240239 0.0098137 -0.0799614 -0.0427754 -0.002238 -0.0711675 0.007352 0.1103509 0.006012 -0.1142784 -0.0003817 0.0635833 -0.0702861 0.000924 -0.083412 -0.0031441 0.1583244 0.0037092 -0.1035106 0.0032802 0.0385436 -0.1008827 -0.006312 0.0560169 -0.0045368 0.1381139 0.0013534 0.0856227 0.0045876 0.0622049 unknown
polarizability: 184.4989061|-8.8174206|107.1039786|11.1746959|0.4757754|118.1054385 unknown
InChI: InChI=1S/C10H12N2OS/c1-7-9(13)12(2)10(14-7)8-4-3-5-11-6-8/h3-7,10H,1-2H3
charge 0 multiplicity 1
26 atoms
S  0.978082 -1.711091 -1.118034
O  3.255298 1.020308 0.7113
N  1.18456 0.896008 -0.380949
N  -2.544302 -0.059089 1.595431
C  0.204805 0.058859 -1.07869
C  2.495427 -1.164018 -0.112785
C  2.364023 0.35053 0.114245
C  -1.168952 0.038076 -0.435381
C  2.639718 -1.92823 1.216124
C  0.939423 2.343926 -0.28992
C  -2.33651 0.045755 -1.234411
C  -1.332363 -0.012953 0.974065
C  -3.602413 -0.010677 -0.609757
C  -3.658774 -0.062859 0.801065
H  0.115974 0.377535 -2.13558
H  3.383725 -1.328987 -0.746535
H  3.514393 -1.53564 1.76553
H  1.740518 -1.804495 1.84381
H  2.789164 -3.006185 1.034361
H  0.865831 2.79277 -1.298546
H  1.794813 2.787097 0.245818
H  0.008536 2.554143 0.265824
H  -2.256086 0.090627 -2.327546
H  -0.455751 -0.014915 1.633107
H  -4.5250 -0.011517 -1.198363
H  -4.619041 -0.108078 1.326918
