program: Gaussian 09
title: 000122228
version: EM64L-G09RevD.01
frameworkgroup: C1[X(C12H18N2O4)]
method: RPBEPBE
basis: SDD
operation: Freq
keyword: #p
keyword: freq=noraman
keyword: PBEPBE/SDD
title: #p freq=noraman PBEPBE/SDD
converged: YES YES NO NO
title: Mulliken charges:
elementType: O O O O N N C C C C C C C C C C C C H H H H H H H H H H H H H H H H H H
charge: -0.426000 -0.413913 -0.228591 -0.213263 -0.206734 -0.576184 -0.375498 -0.333427 -0.482138 -0.431435 -0.176852 0.331959 0.326210 -0.375663 -0.355785 -0.458910 0.135509 -0.208689 0.224161 0.215535 0.242591 0.188168 0.236780 0.233296 0.214621 0.233894 0.249421 0.260769 0.279063 0.201943 0.239988 0.282253 0.284331 0.161274 0.340051 0.381267
chargesum: 0.00000
title: Mulliken charges with hydrogens summed into heavy atoms:
elementType: O O O O N N C C C C C C C C C C C C
charge: -0.085949 -0.032646 -0.228591 -0.213263 -0.206734 -0.009600 0.064197 0.097332 -0.012062 0.017080 0.072569 0.331959 0.326210 -0.114895 -0.076723 -0.016980 0.135509 -0.047415
polarizability: 1.76978386e+02 1.91398034e+00 1.93081988e+02 -1.28686637e+01 -9.07619466e+00 1.15601225e+02
1716.lowfreq: -5.0628 -1.4578 -0.0007 -0.0005 -0.0003 8.5346 15.8812 19.5416 33.9507
frequency: 15.3823 19.0155 33.9392 41.5922 49.1510 64.4985 73.1312 101.4672 122.2816 133.6883 150.1155 166.4414 186.2369 203.7488 210.6744 218.8747 270.0435 283.1212 333.8410 352.9147 361.8131 369.3007 390.6555 423.5932 499.3398 524.1494 595.0385 606.7405 632.9582 655.9281 676.7538 696.6829 710.7710 734.6097 747.1553 784.2326 797.1555 804.9923 850.8302 883.2815 897.1390 908.6128 941.8695 951.5576 961.7470 976.0200 1024.1368 1032.9917 1036.9778 1043.6374 1062.4343 1082.1070 1139.9719 1142.4714 1163.9070 1190.2978 1215.7018 1221.8136 1228.7403 1249.1801 1269.8422 1278.2319 1287.5013 1291.2516 1307.2923 1319.8172 1333.1913 1357.5271 1361.0671 1365.0667 1367.8051 1374.2464 1420.4331 1424.5135 1460.5091 1468.3054 1473.0619 1484.8055 1491.0498 1508.2151 1531.1478 1594.1560 1653.9110 1656.3249 2859.4777 2962.6848 2974.1055 2977.4406 2983.8955 3014.0004 3019.7024 3029.9868 3039.9756 3057.8468 3073.5985 3092.7117 3214.3972 3237.8968 3442.7414 3499.8982 3553.5008 3564.3438
redmass: 5.2037 6.7286 7.4896 4.2507 4.8259 3.9737 6.8226 2.9090 2.2214 2.7037 3.6525 1.5112 3.3158 3.3000 1.3938 2.7907 2.9981 3.0482 2.6837 2.8290 3.8748 3.3615 3.8856 4.2511 3.0479 3.8653 1.5590 2.3141 3.6583 4.8558 4.3885 1.8304 3.2023 3.3881 1.1091 1.4538 2.0212 1.9121 4.0241 1.6330 1.4524 4.5588 2.5759 1.8276 1.7654 2.3092 2.6893 2.4508 1.4306 1.6456 2.3526 2.6616 1.3209 2.4990 1.8589 2.2810 1.3916 1.5547 1.5123 1.3230 1.4867 1.2423 1.2275 1.4296 1.2399 1.3989 2.4033 1.5306 2.1199 1.3928 1.4188 1.3182 2.0696 3.5686 1.0817 1.1155 1.1065 1.2120 3.5196 1.1412 5.6223 5.8583 1.2146 4.8130 1.0823 1.0630 1.0702 1.0608 1.0598 1.0622 1.0931 1.0883 1.0980 1.1023 1.1040 1.0931 1.0932 1.1040 1.0456 1.0641 1.0668 1.0962
irintensity: 0.5954 0.9224 1.8220 0.5787 1.4188 0.5178 2.8370 0.7284 1.3362 0.3523 4.0903 85.1935 28.7903 20.6301 26.7854 25.3638 12.6612 14.4877 4.9535 12.2524 3.4650 9.2600 11.1108 20.2758 11.0148 8.6328 107.5707 36.7278 3.3148 0.7442 11.9434 201.0491 68.6306 33.2992 6.0365 14.0928 38.5842 29.2595 16.9777 2.1439 4.3854 90.7695 17.2742 3.6400 2.1277 2.5632 10.5811 226.3215 8.0472 12.3047 1.8982 4.3496 17.8884 18.9523 10.8302 70.8419 15.4131 20.8354 1.7657 19.0636 7.4115 19.3945 19.1341 19.0709 1.3937 8.2118 57.5159 0.3835 7.7671 8.9396 29.4822 59.9347 3.6587 71.6681 5.1681 2.7554 2.2552 13.0392 30.3332 15.0718 40.2421 300.2574 6.1685 271.8577 137.8695 10.5280 72.1149 6.6377 38.2656 37.6032 2.3128 10.8550 0.8069 29.9524 44.1317 13.2100 1.3973 0.9979 1.5941 14.6392 11.0414 4.5750
temp: 298.150 k
press: 1.00000 atm
elementType: 8 8 8 8 7 7 6 6 6 6 6 6 6 6 6 6 6 6 1 1 1 1 1 1 1 1 1 1 1 1 1 1 1 1 1 1
symmnumber: 1
zpe: 765161.0 jmol-1
zpe.correction: 0.291434 hartree
zpe.thermalcorrener: 0.311440 hartree
zpe.thermalcorrenthalpy: 0.312384 hartree
zpe.thermalcorrgfe: 0.238850 hartree
zpe.sumelectzpe: -877.065073 hartree
zpe.sumelectthermal: -877.045067 hartree
zpe.sumelectthermalent: -877.044123 hartree
zpe.sumelectthermalfe: -877.117657 hartree
dipole: 3.8868 -1.9852 -0.9470
dipole: 4.4659
quadrupole: -115.8148 -131.2285 -103.1644
quadrupole: 12.8130 -8.4238 2.1092
quadrupole: 0.9211 -14.4926 13.5715 12.8130 -8.4238 2.1092
hfenergy: -877.3565077 hartree
pointgroup: C01 [X(C12H18N2O4)]
dipole: -1.5717145 0.6586154 -0.4279031 debye
polarizability: 176.8379167|2.0208954|194.3408313|12.1381966|3.1434289|114.4828505 unknown
InChI: InChI=1S/C12H18N2O4/c13-11(12(17)18)3-1-2-6-14-9(7-15)4-5-10(14)8-16/h4-5,7,11,16-17H,1-3,6,8,13H2
charge 0 multiplicity 1
36 atoms
O  3.206267 3.348114 -0.903589
O  -5.362177 -1.897885 0.270935
O  -5.969889 0.161767 1.162898
O  3.144012 -3.447728 -0.087127
N  2.316756 0.15787 -0.177518
N  -4.239301 1.475859 -0.759373
C  -0.189476 -0.056012 0.072418
C  -1.537059 0.080827 -0.668366
C  1.005583 0.26475 -0.854972
C  -2.739632 -0.247571 0.239544
C  -4.095795 0.04319 -0.472224
C  3.03059 1.216591 0.393025
C  2.996628 -1.05179 0.097702
C  4.18259 0.678303 1.016119
C  4.162019 -0.728067 0.835922
C  2.615998 2.65249 0.269578
C  -5.238395 -0.508329 0.401316
C  2.539485 -2.362095 -0.34001
H  -0.076704 -1.081757 0.47485
H  -0.166776 0.629793 0.942552
H  -1.667094 1.109294 -1.056567
H  -1.549078 -0.59865 -1.54678
H  1.000745 -0.412741 -1.728471
H  0.897936 1.289809 -1.251413
H  -2.690207 0.360968 1.165682
H  -2.712051 -1.311356 0.542761
H  -4.106526 -0.517447 -1.425039
H  4.940078 1.267876 1.530362
H  4.887309 -1.463273 1.178989
H  1.511906 2.759846 0.250963
H  2.998557 3.221205 1.131049
H  -4.407368 2.029926 0.089489
H  -4.941238 1.686583 -1.476645
H  1.594547 -2.377971 -0.940487
H  3.157572 2.749471 -1.692602
H  -6.082311 -2.23146 0.873128
