program: Gaussian 09
title: 000014598
version: EM64L-G09RevD.01
frameworkgroup: C1[X(C12H16FNO2)]
method: RPBEPBE
basis: SDD
operation: Freq
keyword: #p
keyword: freq=noraman
keyword: PBEPBE/SDD
title: #p freq=noraman PBEPBE/SDD
converged: YES YES NO NO
title: Mulliken charges:
elementType: F O O N C C C C C C C C C C C C H H H H H H H H H H H H H H H H
charge: -0.251327 -0.266029 -0.243988 -0.423306 -0.575762 0.547456 0.464621 -0.501602 -0.577373 -0.447895 -0.442350 -0.202283 -0.338036 0.252334 -0.242953 -0.505739 0.219551 0.237034 0.259327 0.253529 0.231441 0.232881 0.303641 0.221158 0.218556 0.210275 0.229624 0.215720 0.206057 0.239782 0.233507 0.242147
chargesum: 0.00000
title: Mulliken charges with hydrogens summed into heavy atoms:
elementType: F O O N C C C C C C C C C C C C
charge: -0.251327 -0.266029 -0.243988 -0.119665 -0.119177 0.547456 0.464621 0.011255 -0.345932 -0.215014 -0.221191 0.016273 0.101863 0.252334 0.178824 0.209698
polarizability: 1.97089246e+02 -6.41141538e+00 1.47749832e+02 -5.28582340e+00 -1.13835392e+01 9.63198753e+01
1716.lowfreq: -8.2474 -6.7436 -2.8768 0.0003 0.0005 0.0010 13.2704 17.4713 37.2303
frequency: 12.4723 17.4078 37.2097 48.5945 62.2634 72.1763 97.3716 103.3817 141.2222 153.1542 199.7846 220.7528 236.5716 276.7069 284.5899 322.8496 402.7063 423.0672 453.0952 459.8265 520.9997 543.9971 563.7469 604.4370 616.5401 671.4007 700.2609 740.5377 782.6523 789.2702 827.9160 844.1040 863.1836 871.0123 897.8238 950.5437 962.4368 963.3791 983.1643 1009.0157 1022.2662 1047.5719 1086.5327 1096.1624 1112.7297 1119.5898 1136.7042 1147.6495 1166.3960 1179.0254 1193.4364 1202.8906 1233.0894 1262.4502 1282.6433 1299.8124 1317.7958 1347.5629 1363.7367 1373.2816 1394.0424 1422.2045 1443.5352 1445.7386 1452.7879 1457.4664 1464.3599 1465.5745 1475.8847 1482.0518 1514.5879 1597.0446 1625.3354 1642.9761 2923.9156 2991.7322 3000.3028 3003.4946 3004.2811 3028.2704 3056.0324 3080.4683 3103.8560 3104.9143 3113.6513 3125.9422 3130.7476 3148.5612 3150.7443 3546.2124
redmass: 5.1861 6.8568 5.0740 2.5164 4.1127 4.5599 1.0803 3.6048 3.7301 4.3542 3.4952 3.7065 4.8336 2.3334 3.9103 3.0708 3.9742 3.7177 2.6008 3.0393 1.3503 4.5130 3.5601 3.5963 4.1409 4.2512 1.9131 3.1010 1.4485 1.5837 2.9945 3.4656 1.8378 1.5414 2.4028 4.4570 2.9234 1.3510 4.6240 2.5075 2.1953 4.0391 1.7449 1.8739 1.2905 2.0158 2.3730 1.4433 1.5262 1.0822 1.2741 1.5887 1.2072 1.2578 1.3801 1.6777 1.4368 1.5525 1.5013 1.3103 4.8355 1.1882 1.5684 1.5802 1.0501 1.1045 1.0515 1.1464 1.7160 1.1696 2.2067 5.4243 6.2035 9.1167 1.0674 1.0649 1.0884 1.0381 1.0524 1.0599 1.0977 1.0989 1.1117 1.1045 1.0859 1.0911 1.0902 1.1047 1.0992 1.0762
irintensity: 0.7418 1.4857 1.9754 0.1136 2.7283 3.5580 0.0983 5.8065 0.8633 3.1082 9.0664 0.0913 1.8216 1.7557 25.0763 6.2116 1.7954 8.7313 25.5989 0.4089 130.3810 11.4779 5.2709 5.7412 2.2108 6.6395 28.8304 1.7891 22.7348 47.6004 5.8258 35.1870 17.2065 4.9630 7.1544 11.6105 6.2831 0.6572 11.8892 58.3560 6.8714 37.1450 7.3625 1.6024 7.4472 143.9506 26.1767 10.5715 117.7533 5.3945 11.2504 1.7226 27.8855 30.0565 75.1231 16.5421 13.3987 31.5688 3.4860 8.4399 26.6567 22.9177 34.9236 29.5181 13.9677 16.9407 15.7543 46.3860 4.7358 13.5258 128.6758 46.0614 223.7473 167.5311 73.1459 3.7161 11.3882 28.3219 33.8962 61.3735 2.7186 15.7649 33.9508 28.6779 3.6023 26.7843 24.9079 16.6910 22.2551 47.2301
temp: 298.150 k
press: 1.00000 atm
elementType: 9 8 8 7 6 6 6 6 6 6 6 6 6 6 6 6 1 1 1 1 1 1 1 1 1 1 1 1 1 1 1 1
symmnumber: 1
zpe: 682587.2 jmol-1
zpe.correction: 0.259984 hartree
zpe.thermalcorrener: 0.277038 hartree
zpe.thermalcorrenthalpy: 0.277982 hartree
zpe.thermalcorrgfe: 0.210727 hartree
zpe.sumelectzpe: -770.703055 hartree
zpe.sumelectthermal: -770.686001 hartree
zpe.sumelectthermalent: -770.685057 hartree
zpe.sumelectthermalfe: -770.752312 hartree
dipole: -0.2556 -0.9413 -0.2001
dipole: 0.9957
quadrupole: -85.1218 -88.2244 -100.8960
quadrupole: -3.0992 11.9834 -1.4721
quadrupole: 6.2923 3.1897 -9.4820 -3.0992 11.9834 -1.4721
hfenergy: -770.9630389 hartree
pointgroup: C01 [X(C12H16F1N1O2)]
dipole: -0.1034406 -0.3772293 -0.021494 debye
polarizability: 197.1041279|-7.2294528|143.0438262|-2.2806522|-18.9636003|101.0109989 unknown
InChI: InChI=1S/C12H16FNO2/c1-16-12(15)6-5-10-3-2-4-11(9-10)14-8-7-13/h2-4,9,14H,5-8H2,1H3
charge 0 multiplicity 1
32 atoms
F  5.536511 -1.87918 -0.485431
O  -4.70761 -0.647125 -0.918663
O  -3.924177 -1.299106 1.175177
N  3.31929 -0.16501 0.039118
C  -1.599103 0.475057 0.811209
C  -0.24825 1.002652 0.347252
C  2.164543 0.624672 -0.051217
C  -2.440943 -0.06034 -0.377656
C  0.895816 0.170806 0.411931
C  -0.132934 2.306895 -0.194707
C  2.259314 1.937505 -0.602507
C  1.120676 2.760673 -0.668471
C  3.316632 -1.561239 0.464862
C  -3.727236 -0.727719 0.077743
C  4.739273 -2.029926 0.745355
C  -5.995759 -1.314346 -0.606696
H  -2.1700 1.275722 1.318233
H  -1.475119 -0.340779 1.545554
H  -2.680325 0.738649 -1.099957
H  -1.850128 -0.815096 -0.934745
H  0.786946 -0.838301 0.825865
H  -1.011591 2.960798 -0.241749
H  4.125129 0.117611 -0.521688
H  3.228832 2.305428 -0.961359
H  1.213293 3.769563 -1.087147
H  2.741596 -1.670002 1.406813
H  2.843799 -2.233329 -0.28695
H  5.233029 -1.404552 1.509989
H  4.772089 -3.099013 1.018026
H  -5.837375 -2.393198 -0.43954
H  -6.624134 -1.137884 -1.490797
H  -6.445985 -0.872086 0.297851
