program: Gaussian 09
title: 000122347
version: EM64L-G09RevD.01
frameworkgroup: C1[X(C20H23N7O7)]
method: RPBEPBE
basis: SDD
operation: Freq
keyword: #p
keyword: freq=noraman
keyword: PBEPBE/SDD
title: #p freq=noraman PBEPBE/SDD
converged: YES YES NO NO
title: Mulliken charges:
elementType: O O O O O O O N N N N N N N C C C C C C C C C C C C C C C C C C C C H H H H H H H H H H H H H H H H H H H H H H H
charge: -0.293875 -0.257964 -0.277010 -0.396627 -0.277203 -0.419084 -0.238897 -0.405403 -0.392628 -0.202961 -0.437095 -0.192069 -0.416328 -0.652539 -0.163051 -0.443971 -0.413116 0.207603 0.276113 0.514524 0.006231 -0.107127 0.175251 -0.353972 -0.403133 -0.163262 0.320896 -0.388105 -0.377786 -0.376655 0.080291 -0.498293 0.163901 0.180357 0.262960 0.264137 0.223677 0.258124 0.208423 0.331738 0.289489 0.310494 0.196790 0.219435 0.245773 0.306960 0.239326 0.274461 0.260527 0.262823 0.426170 0.335425 0.236742 0.298820 0.415294 0.383590 0.371809
chargesum: 0.00000
title: Mulliken charges with hydrogens summed into heavy atoms:
elementType: O O O O O O O N N N N N N N C C C C C C C C C C C C C C C C C C C C
charge: -0.293875 -0.257964 -0.277010 -0.013037 -0.277203 -0.047275 -0.238897 -0.073665 -0.103139 -0.202961 -0.126601 -0.192069 0.009843 0.061574 0.099909 0.043843 0.053431 0.207603 0.276113 0.514524 0.006231 0.089663 0.175251 -0.134537 -0.157360 0.143697 0.320896 0.125681 -0.117259 -0.113832 0.080291 0.073874 0.163901 0.180357
polarizability: 3.85555699e+02 1.24990599e+01 2.72960051e+02 2.98869303e+01 -3.54372529e+01 2.19840947e+02
1716.lowfreq: -6.5431 -0.0008 -0.0005 -0.0003 2.5433 6.2903 17.7971 30.9867 32.3702
frequency: 17.6082 30.9824 32.3655 40.7967 48.0806 55.9889 63.1057 75.7785 82.8524 88.4231 90.1960 102.6475 110.1438 114.1412 127.4581 136.4089 147.0385 164.5385 194.9947 196.5333 202.5102 217.6467 226.6944 235.9365 246.2782 268.2710 292.5625 309.6625 320.8218 326.4873 341.4199 354.7717 360.7229 371.3188 406.1875 411.0933 421.0938 426.6606 447.3672 452.9039 459.3174 472.6684 478.5146 483.8726 504.4254 505.7105 517.8830 530.5028 552.2030 563.6925 571.3750 578.9464 594.8198 609.5251 628.0555 631.7173 642.4787 645.0285 679.0521 681.9586 700.5457 715.3174 734.2146 739.4259 751.7467 770.9940 786.4026 803.8734 819.5706 824.8291 835.3509 844.9568 853.1775 869.7533 891.9140 896.7659 937.2305 945.4692 947.3670 962.7928 965.3000 970.0612 973.3174 999.0082 1009.1595 1020.5367 1035.4564 1042.7073 1063.4746 1067.3746 1067.9559 1086.9548 1109.9040 1122.7250 1126.7992 1161.1609 1169.8289 1191.7660 1192.5481 1198.2677 1234.2739 1234.6647 1245.0864 1246.5994 1249.2213 1256.2689 1266.4158 1287.9381 1297.2129 1301.5756 1304.8080 1310.3211 1330.8439 1335.7243 1339.7008 1349.6534 1351.5204 1364.8848 1374.1528 1386.1007 1388.1686 1392.0130 1413.3055 1440.5388 1447.5608 1451.5749 1457.0664 1469.8452 1470.3002 1500.8726 1510.4370 1536.9073 1548.0029 1575.1955 1590.6425 1600.9293 1601.8897 1621.9780 1642.3809 1657.1831 1663.0546 1682.4914 2940.9573 2984.2533 3005.0485 3016.8024 3022.8526 3026.1732 3031.9940 3036.4722 3041.9357 3081.6374 3091.5874 3092.2282 3134.1171 3142.5499 3156.7143 3168.2508 3349.0351 3485.5682 3510.2726 3515.9850 3539.6229 3560.1213 3640.7444
redmass: 8.7713 8.2203 11.4343 8.0888 7.2805 6.8506 6.4817 5.8461 8.7296 8.4495 5.3119 8.9708 5.3377 3.1747 6.1969 6.6499 5.3897 6.4039 4.3969 5.2641 5.9923 5.6171 4.8846 4.2628 3.8740 6.1297 3.1604 3.0075 3.5216 1.7709 4.4621 3.4547 3.3011 2.9205 3.2704 2.9339 4.4439 3.5469 3.3664 1.4563 2.9412 4.4067 4.5227 4.7809 1.5318 1.9690 2.0500 4.3338 3.2406 3.2028 2.5106 7.0730 4.2872 4.5775 5.7117 1.7027 1.4918 4.3347 8.4988 6.0454 4.5676 4.4556 5.1600 9.5857 4.4202 2.1797 3.2153 2.9612 3.6289 1.2907 1.1305 1.7116 3.1045 3.3466 3.4924 2.6838 2.7810 2.2731 1.5291 1.5420 1.8396 1.9937 1.4958 3.6061 2.6893 2.5185 2.6980 2.9483 2.8461 2.1020 2.4717 2.7252 2.6340 1.3787 3.0987 2.5105 2.7088 1.2385 1.1757 1.7080 1.4864 1.3839 1.8797 1.4970 2.4486 1.9341 1.6176 2.0815 1.2868 2.2794 2.2100 1.5826 1.6526 1.4227 1.3695 1.3227 2.0437 1.4954 2.6444 1.9203 1.7525 1.7069 3.3453 2.0781 1.1427 1.6294 1.2268 1.2208 1.1954 2.6526 3.5938 2.6004 9.1511 4.4677 2.7109 3.0535 5.6835 6.2715 5.0528 1.6971 7.8145 5.2879 1.0698 1.0876 1.0838 1.0586 1.0622 1.0686 1.0831 1.0915 1.0855 1.1039 1.1057 1.1031 1.0870 1.0888 1.0960 1.0966 1.0625 1.0767 1.0638 1.0641 1.0776 1.0779 1.0907
irintensity: 0.2868 0.8365 0.8775 0.1626 1.5081 1.3130 0.7629 2.3509 1.0489 0.9792 3.6354 8.0563 0.7542 4.5579 2.8834 6.3654 2.7561 5.5990 2.7322 5.1752 3.2755 10.2485 6.5421 7.2654 23.1802 23.3929 7.0396 13.3515 13.2279 25.8712 9.2499 11.0124 49.1887 10.0609 30.0199 1.6756 20.8323 140.1121 20.6910 95.9744 139.6985 8.5718 20.1485 7.0075 151.4354 91.8112 19.2995 40.7410 18.3916 38.5259 93.4871 11.1341 22.0992 2.8905 0.3396 63.6108 103.2316 5.9345 1.5001 3.3184 30.5809 19.0984 10.2590 13.5106 20.2112 16.6593 8.8486 22.9138 1.9695 17.6065 155.8358 24.7322 10.5572 44.9097 45.4077 2.2450 4.4040 14.5631 20.1726 7.4104 2.2454 12.4587 14.3618 2.7458 3.0053 97.9669 8.5503 327.2347 6.4969 25.5929 145.2060 34.1877 55.4218 3.9926 38.3729 5.6486 17.7310 19.7427 12.0991 138.3603 33.1421 11.9355 34.1275 3.8470 21.2321 16.3175 14.9513 10.5271 3.0266 10.1096 131.6565 42.1580 48.7850 31.1376 36.6357 17.1141 143.7860 37.6072 30.4350 18.2718 56.5006 6.0057 1.7121 185.8197 17.9971 11.9110 49.0715 8.5719 19.0630 64.4106 92.0658 146.8610 476.6933 67.3729 265.5090 261.4236 352.0368 50.6387 294.9670 296.7646 232.0598 143.0102 96.4204 42.3817 112.6934 11.4531 56.7919 192.1755 284.3037 154.8105 25.1676 12.0573 14.0577 8.4703 8.6616 7.0124 12.9323 1.8573 729.1427 3.0914 17.5607 33.4793 26.1938 45.2987 75.6082
temp: 298.150 k
press: 1.00000 atm
elementType: 8 8 8 8 8 8 8 7 7 7 7 7 7 7 6 6 6 6 6 6 6 6 6 6 6 6 6 6 6 6 6 6 6 6 1 1 1 1 1 1 1 1 1 1 1 1 1 1 1 1 1 1 1 1 1 1 1
symmnumber: 1
zpe: 1144841.0 jmol-1
zpe.correction: 0.436047 hartree
zpe.thermalcorrener: 0.467646 hartree
zpe.thermalcorrenthalpy: 0.468590 hartree
zpe.thermalcorrgfe: 0.372629 hartree
zpe.sumelectzpe: -1683.334036 hartree
zpe.sumelectthermal: -1683.302436 hartree
zpe.sumelectthermalent: -1683.301492 hartree
zpe.sumelectthermalfe: -1683.397453 hartree
dipole: 2.8295 11.1210 -4.8126
dipole: 12.4436
quadrupole: -204.4375 -191.9038 -189.3871
quadrupole: 2.3954 3.4238 -16.8619
quadrupole: -9.1947 3.3390 5.8557 2.3954 3.4238 -16.8619
hfenergy: -1683.7700824 hartree
pointgroup: C01 [X(C20H23N7O7)]
dipole: -1.664085 3.515905 2.9727282 debye
polarizability: 387.3917421|-3.1294644|247.5068571|23.0603108|46.9784101|243.4580984 unknown
InChI: InChI=1S/C20H23N7O7/c21-20-25-16-15(18(32)26-20)23-11(7-22-16)8-27(9-28)12-3-1-10(2-4-12)17(31)24-13(19(33)34)5-6-14(29)30/h1-4,9,11,13,22-25,29,33H,5-8,21H2
charge 0 multiplicity 1
57 atoms
O  0.168483 0.451935 -1.516719
O  -5.758974 -2.590222 -1.236087
O  2.660662 -3.040926 0.491994
O  5.54241 0.686988 2.014376
O  3.402345 1.397601 2.4826
O  3.798475 2.43717 -3.082215
O  4.770839 0.343993 -3.310655
N  -2.640788 0.718107 -1.321929
N  -3.629607 2.397753 0.75662
N  -3.802605 -1.802552 -0.202901
N  -1.371273 2.568121 1.617439
N  0.470062 1.432385 0.59481
N  2.334304 -0.775208 0.974253
N  0.769254 2.513043 2.653719
C  -4.057077 0.626048 -0.985567
C  -4.480177 2.022864 -0.399556
C  -4.421774 -0.484718 0.06361
C  -1.773236 1.309934 -0.40181
C  -2.266918 2.073586 0.644171
C  -2.416513 -2.031693 0.125131
C  -0.329388 1.063235 -0.509019
C  -4.577997 -2.778836 -0.828991
C  -0.03735 2.157334 1.599058
C  -1.867335 -1.504177 1.320768
C  -1.570793 -2.743024 -0.767951
C  3.776309 -0.527498 0.931904
C  0.379865 -2.169794 0.602597
C  4.303325 -0.252626 -0.517431
C  -0.478035 -1.551075 1.542507
C  -0.188794 -2.830687 -0.513096
C  1.877118 -2.057223 0.699201
C  3.608417 0.94026 -1.203767
C  4.159619 0.599055 1.879112
C  4.131837 1.156761 -2.604912
H  -4.628976 0.429378 -1.910245
H  -4.3722 2.777421 -1.197376
H  -5.53365 2.010845 -0.072213
H  -5.516055 -0.634032 0.041693
H  -4.130748 -0.150336 1.074035
H  -2.207316 0.163551 -2.061422
H  -4.058347 2.339297 1.684968
H  -1.675483 3.332564 2.223081
H  -4.059499 -3.756337 -0.910277
H  -2.514151 -1.030575 2.065996
H  -1.97345 -3.154441 -1.699613
H  4.285122 -1.449937 1.274389
H  5.395891 -0.096686 -0.472085
H  4.129283 -1.17307 -1.100236
H  -0.054991 -1.089601 2.441274
H  0.473144 -3.338562 -1.221166
H  1.687487 0.048616 0.886572
H  2.512782 0.768899 -1.286736
H  3.724113 1.884443 -0.639363
H  0.388102 2.882429 3.521166
H  1.745688 2.180094 2.625185
H  5.775002 1.444881 2.61669
H  4.11326 2.517146 -4.02378
