program: Gaussian 09
title: 000122190
version: EM64L-G09RevD.01
frameworkgroup: C1[X(C18H24INO2)]
method: RPBEPBE
basis: SDD
operation: Freq
keyword: #p
keyword: freq=noraman
keyword: PBEPBE/SDD
title: #p freq=noraman PBEPBE/SDD
converged: NO YES NO NO
title: Mulliken charges:
elementType: I O O N C C C C C C C C C C C C C C C C C C H H H H H H H H H H H H H H H H H H H H H H H H
charge: 0.078027 -0.293967 -0.240475 -0.071363 -0.185898 -0.142723 -0.280576 -0.195881 -0.506412 -0.495475 -0.486046 0.469279 -0.646722 0.268417 -0.433649 -0.325074 0.042428 -0.175185 -0.191240 -0.354663 -0.688661 -0.686174 0.270446 0.232047 0.260716 0.224572 0.207881 0.243330 0.218107 0.236569 0.232871 0.217107 0.228193 0.229922 0.195975 0.232218 0.246164 0.232730 0.244555 0.245623 0.207921 0.233529 0.219207 0.210618 0.261345 0.210386
chargesum: 0.00000
title: Mulliken charges with hydrogens summed into heavy atoms:
elementType: I O O N C C C C C C C C C C C C C C C C C C
charge: 0.078027 -0.293967 -0.240475 -0.071363 0.084548 0.089324 -0.019860 0.028691 -0.055201 -0.040799 -0.036068 0.469279 0.007367 0.268417 -0.201431 -0.078910 0.275158 0.069371 0.054383 -0.354663 -0.028003 -0.003825
polarizability: 3.04838682e+02 -2.09395192e+01 1.87767259e+02 5.80732202e-01 -6.40583138e+00 1.82561264e+02
1716.lowfreq: -8.3563 -5.1141 -0.0008 -0.0008 -0.0007 6.3969 16.2684 24.4965 36.5932
frequency: 14.8415 24.1587 36.5652 39.2612 58.1364 85.2590 91.4356 113.2873 124.0994 141.2370 150.6168 184.7678 187.8214 195.9330 208.2471 217.4164 248.7583 253.1922 278.3403 286.2383 324.4178 332.6313 354.7897 366.0912 389.1113 402.8383 411.0356 450.2526 479.9127 511.9984 534.6458 561.7746 623.8620 629.3249 648.9326 694.0450 712.9208 733.5612 748.6286 762.0343 782.4832 785.4069 819.3111 827.9625 828.7115 853.7207 882.4390 889.0876 905.9158 928.7205 935.8281 942.2155 948.9858 960.9213 964.0789 965.3895 990.9386 992.0511 1023.5106 1037.9130 1050.1781 1058.4007 1087.2512 1100.8984 1106.2540 1114.4922 1128.4605 1134.3713 1148.6309 1154.2927 1156.8667 1183.7075 1192.8134 1198.7912 1207.8517 1216.3693 1229.2860 1236.3940 1249.5464 1275.2697 1282.6264 1290.3606 1297.1905 1299.5893 1315.7945 1319.3810 1336.8670 1342.2484 1346.8937 1359.7687 1376.9622 1381.6520 1396.6440 1403.1228 1427.2441 1451.3283 1457.1873 1463.9094 1464.9447 1466.2667 1469.3718 1471.7616 1479.6318 1486.2658 1486.8925 1573.1556 1593.4448 1638.7394 2882.5546 2972.8471 2986.7862 2991.3583 2998.9118 3001.7449 3006.5628 3014.5586 3023.8485 3025.2584 3042.4357 3053.0669 3063.2021 3076.2523 3079.3328 3080.4592 3080.7870 3091.3949 3097.9400 3103.2384 3111.4139 3156.8226 3162.9197 3182.6405
redmass: 5.0250 3.7649 4.5586 2.8545 4.2023 4.0923 4.9275 4.7708 7.1237 6.8519 4.3684 1.0316 1.1856 2.0840 3.3177 1.5015 2.3418 2.6553 4.0422 3.0518 5.7752 3.1936 3.3265 2.3654 3.4130 2.8303 3.1244 2.9047 3.4731 3.6578 3.6051 3.1401 6.9811 5.8330 4.0534 5.1573 3.5805 4.6272 3.6776 4.0878 2.3255 2.3689 2.1370 1.2914 1.9513 2.8822 2.9569 2.7173 2.6192 1.2170 3.1503 1.4156 1.3981 2.1287 1.3978 2.2386 4.9601 2.5797 2.2366 2.1944 2.0534 2.3931 2.8740 1.6277 1.5778 1.7953 2.0413 1.3961 1.4037 1.8987 2.0360 1.8911 1.1524 1.7588 1.3732 1.4449 1.8061 1.6561 1.4883 1.3748 1.4711 1.3384 1.3641 1.4730 1.4587 1.3397 1.4218 1.6685 1.6064 1.5631 4.3649 1.2600 1.2292 1.7836 1.1718 1.0889 1.0523 1.0513 1.0674 1.0572 2.3404 1.0500 1.0511 1.0633 1.0769 6.8895 6.0295 10.7117 1.0534 1.0810 1.0358 1.0359 1.0633 1.0601 1.0818 1.0630 1.0758 1.0862 1.0884 1.1019 1.0909 1.1022 1.1004 1.1009 1.0997 1.0988 1.1003 1.1004 1.0895 1.0896 1.0948 1.0954
irintensity: 0.2047 0.3847 0.2190 0.1856 0.6521 0.8384 0.1593 0.7107 1.1674 0.3297 1.1030 0.0186 0.1842 0.2887 0.5358 4.6566 2.9924 7.0777 1.2038 0.9995 4.2773 2.6541 0.1644 1.4283 4.0539 0.1601 3.3272 5.3681 15.2570 3.4335 1.9461 20.6483 2.0353 10.4722 9.2217 4.1510 2.1059 8.2720 21.6625 5.3181 12.3434 4.9385 34.9690 0.4422 15.2611 1.5779 9.9022 2.0293 5.7244 2.2942 52.4317 1.2057 1.5716 4.8565 1.2239 21.0246 56.9565 52.5513 14.8728 7.0896 3.2629 16.9576 401.0207 0.0949 3.2080 29.7157 25.9274 22.0649 10.2811 29.1905 12.9380 5.8504 2.1588 18.9853 0.5049 14.8353 28.8681 2.8919 12.0321 6.5438 9.6704 12.7027 1.7802 5.5116 1.8997 10.9489 7.3503 10.4548 19.2338 4.6689 2.2830 31.0637 18.1640 10.9560 5.0267 13.5776 5.0046 10.5900 6.3373 11.2198 86.9691 7.3432 2.7594 46.1842 3.1686 1.7967 7.5789 135.7601 122.5596 20.4600 15.5663 27.6217 20.1946 26.6860 14.6335 43.5602 45.6231 5.1268 53.5203 2.3684 6.6219 55.6936 35.0103 38.2619 8.6697 55.8166 21.1407 27.5908 14.9935 3.5460 7.6123 4.1655
temp: 298.150 k
press: 1.00000 atm
elementType: 53 8 8 7 6 6 6 6 6 6 6 6 6 6 6 6 6 6 6 6 6 6 1 1 1 1 1 1 1 1 1 1 1 1 1 1 1 1 1 1 1 1 1 1 1 1
symmnumber: 1
zpe: 1005304.1 jmol-1
zpe.correction: 0.382900 hartree
zpe.thermalcorrener: 0.405065 hartree
zpe.thermalcorrenthalpy: 0.406009 hartree
zpe.thermalcorrgfe: 0.328570 hartree
zpe.sumelectzpe: -915.351470 hartree
zpe.sumelectthermal: -915.329306 hartree
zpe.sumelectthermalent: -915.328361 hartree
zpe.sumelectthermalfe: -915.405800 hartree
dipole: 4.5771 -0.6407 1.4734
dipole: 4.8509
quadrupole: -141.5865 -136.7264 -142.8976
quadrupole: -1.8636 0.7830 -0.9365
quadrupole: -1.1830 3.6771 -2.4941 -1.8636 0.7830 -0.9365
hfenergy: -915.7343702 hartree
pointgroup: C01 [X(C18H24I1N1O2)]
dipole: -1.7864527 -0.1561535 0.6531536 debye
polarizability: 307.9156743|4.723152|183.5732049|-7.2766526|6.0010123|183.6783253 unknown
InChI: InChI=1S/C18H24INO2/c1-11(2)22-18(21)17-15(12-4-6-13(19)7-5-12)10-14-8-9-16(17)20(14)3/h4-7,11,14-17H,8-10H2,1-3H3
charge 0 multiplicity 1
46 atoms
I  6.432735 1.090678 -0.256085
O  -0.750898 -2.378918 0.589689
O  0.076258 -1.185695 -1.234552
N  -2.772476 0.409495 -0.435056
C  -2.252075 0.151363 0.941874
C  -2.384057 1.84468 -0.634261
C  -0.697572 -0.001392 0.824091
C  -0.067801 1.341362 0.32222
C  -0.85659 1.883858 -0.900086
C  -2.661685 1.415777 1.782012
C  -2.774817 2.556156 0.714112
C  1.451491 1.277863 0.143883
C  -4.21872 0.138191 -0.59464
C  -0.402363 -1.198385 -0.07886
C  2.284202 1.429527 1.283169
C  2.077471 1.075013 -1.11135
C  -0.593524 -3.669445 -0.176303
C  3.693562 1.375368 1.189508
C  3.48417 1.025572 -1.229984
C  4.282425 1.17316 -0.076481
C  -0.422581 -4.754207 0.889168
C  -1.821583 -3.860808 -1.078021
H  -2.670884 -0.785884 1.343579
H  -2.921794 2.261089 -1.504053
H  -0.299397 -0.245428 1.828382
H  -0.237008 2.053917 1.155827
H  -0.532964 2.920001 -1.118132
H  -0.660836 1.261847 -1.789653
H  -1.927657 1.645975 2.57503
H  -3.631614 1.237646 2.279274
H  -3.805951 2.948243 0.661575
H  -2.109515 3.410385 0.933015
H  -4.40633 -0.934908 -0.411708
H  -4.513535 0.359205 -1.635838
H  -4.88436 0.7252 0.083341
H  1.830048 1.601828 2.267855
H  1.469294 0.930017 -2.007288
H  0.31636 -3.564421 -0.79638
H  4.312237 1.49607 2.083577
H  3.943873 0.865363 -2.209246
H  -0.27801 -5.737672 0.406193
H  0.454675 -4.544741 1.524706
H  -1.316679 -4.811285 1.53502
H  -1.723794 -4.799366 -1.654211
H  -1.914033 -3.024325 -1.790559
H  -2.742899 -3.920168 -0.470852
