program: Gaussian 09
title: 000122099
version: EM64L-G09RevD.01
frameworkgroup: C1[X(C13H26O2S)]
method: RPBEPBE
basis: SDD
operation: Freq
keyword: #p
keyword: freq=noraman
keyword: PBEPBE/SDD
title: #p freq=noraman PBEPBE/SDD
converged: YES YES NO NO
title: Mulliken charges:
elementType: S O O C C C C C C C C C C C C C H H H H H H H H H H H H H H H H H H H H H H H H H H
charge: 0.132186 -0.418337 -0.230984 -0.386614 -0.382586 -0.369285 -0.385302 -0.356857 -0.368529 -0.380054 -0.376218 -0.660379 -0.487925 0.170764 -0.578935 -0.657303 0.193278 0.197047 0.193453 0.191896 0.193111 0.186409 0.197265 0.196192 0.187067 0.216728 0.190903 0.191384 0.216714 0.205334 0.216653 0.219252 0.252306 0.245903 0.252107 0.252096 0.245695 0.244582 0.229549 0.229155 0.217407 0.374870
chargesum: 0.00000
title: Mulliken charges with hydrogens summed into heavy atoms:
elementType: S O O C C C C C C C C C C C C C
charge: 0.132186 -0.043467 -0.230984 0.003712 0.002763 0.010235 0.008156 0.046937 0.013758 0.041994 0.059688 -0.162171 0.016278 0.170764 -0.088659 0.018808
polarizability: 2.24391575e+02 -1.11980359e+01 1.50441670e+02 -3.27116670e+00 2.48715701e+00 1.27281856e+02
1716.lowfreq: -0.0015 -0.0008 0.0012 1.5030 5.1210 13.4475 14.3221 17.4742 24.4953
frequency: 13.8752 17.2743 23.8546 32.1460 39.9808 46.4490 57.7908 68.7696 80.1336 96.4980 108.5670 121.0207 126.6089 146.5946 152.6771 172.6393 181.8336 236.2585 239.6816 279.4003 322.2763 347.3090 381.4959 461.2716 470.0689 500.9463 512.0162 588.8505 627.3480 636.6890 640.1305 722.5190 724.7581 735.6590 764.8222 786.3998 809.4839 845.6495 856.9700 880.8724 942.1811 973.6098 988.8120 997.6769 1008.5370 1016.5649 1024.8526 1032.6013 1055.0383 1063.0465 1065.4003 1071.6083 1081.0878 1082.6912 1099.6379 1111.3745 1119.4530 1171.5081 1197.1372 1212.8867 1226.7928 1237.9143 1239.8158 1250.6022 1258.6001 1268.0332 1280.1937 1284.4485 1287.4886 1290.8242 1298.2476 1299.2905 1307.6978 1316.5204 1340.6574 1357.9516 1358.6211 1362.9543 1373.9686 1395.2946 1437.0210 1448.1917 1454.5625 1460.5520 1460.9844 1461.2855 1464.5855 1467.6409 1469.7470 1475.4239 1482.7748 1484.6016 1487.6608 1669.6854 2948.7295 2949.6399 2951.5968 2956.2675 2960.7986 2963.6499 2968.7575 2984.0297 2984.7812 2985.4778 2989.1093 2990.8438 2995.2541 2997.1977 3002.5374 3009.7031 3019.2131 3029.2356 3036.0430 3045.2945 3061.2840 3061.9093 3064.8163 3078.8574 3095.9593 3511.9605
redmass: 6.3104 5.6010 3.2985 5.1515 3.3228 1.7465 2.4816 3.3836 2.0613 3.2715 2.7148 2.1602 3.6981 2.2117 2.0128 3.3300 3.5681 1.5970 1.5731 3.9216 3.3636 3.8439 3.8202 3.1217 3.5966 1.7844 3.0137 4.6625 4.3050 1.3271 3.5476 1.0642 1.0864 1.1541 1.2562 1.1164 1.3582 1.4929 4.8860 1.3945 1.3927 2.6694 4.8043 1.7811 1.3599 2.2691 3.3875 1.2871 2.3152 1.8256 2.5135 1.9833 2.1204 2.1942 2.5125 2.2188 1.4307 1.3985 1.5677 1.3191 1.3877 1.3507 1.2658 1.2955 1.3864 1.2485 1.1231 1.1676 1.1629 1.1674 1.1328 1.1002 1.2114 1.3677 1.4730 1.5951 1.6557 1.6247 1.8280 1.2070 1.0849 1.0911 1.0777 1.0787 1.0848 1.0720 1.0615 1.0908 1.0396 1.0972 1.0999 1.0477 1.1007 8.2138 1.0591 1.0587 1.0591 1.0598 1.0601 1.0596 1.0622 1.0960 1.0355 1.0613 1.0975 1.0588 1.0603 1.0992 1.0568 1.0978 1.1027 1.1001 1.1038 1.1041 1.1071 1.1032 1.1069 1.0988 1.1031 1.0639
irintensity: 0.6919 0.4011 2.6580 0.2525 0.4011 0.1322 0.3741 0.1123 0.3518 0.4191 0.2767 0.1555 0.1483 0.1596 0.0967 1.6885 0.3672 0.5267 0.4491 0.5539 1.7913 3.8712 3.2483 0.5755 15.7411 28.3289 14.2875 14.4986 4.2325 127.5259 0.6423 16.2648 5.0414 6.8078 1.2490 7.4571 8.9524 5.9744 1.3805 1.4426 3.6008 0.4607 39.7604 19.6469 0.1865 26.7781 117.6350 15.6589 56.0300 3.9574 15.3464 10.9605 0.0278 3.0555 17.1034 4.0792 0.5807 17.3365 7.2219 20.8890 2.3310 0.2459 0.1715 14.6776 15.5949 10.6671 0.9850 3.4730 5.9331 13.3897 1.2380 0.0215 8.3996 10.2464 11.3895 5.2275 5.4326 1.0936 30.1956 17.7247 27.7609 11.5591 3.7779 0.5574 2.3366 0.4030 0.0914 0.2154 14.7085 5.0540 0.1519 7.6240 32.2444 207.7669 1.7846 0.1906 10.2372 0.5419 14.0874 50.6758 146.1761 3.5258 39.7403 5.3441 2.3791 34.3648 37.9899 9.3251 31.9563 3.5894 5.1287 3.2708 14.6366 165.2092 38.9053 99.3402 12.4817 33.9336 49.5367 17.5907
temp: 298.150 k
press: 1.00000 atm
elementType: 16 8 8 6 6 6 6 6 6 6 6 6 6 6 6 6 1 1 1 1 1 1 1 1 1 1 1 1 1 1 1 1 1 1 1 1 1 1 1 1 1 1
symmnumber: 1
zpe: 966444.3 jmol-1
zpe.correction: 0.368099 hartree
zpe.thermalcorrener: 0.389628 hartree
zpe.thermalcorrenthalpy: 0.390572 hartree
zpe.thermalcorrgfe: 0.311288 hartree
zpe.sumelectzpe: -1058.174560 hartree
zpe.sumelectthermal: -1058.153031 hartree
zpe.sumelectthermalent: -1058.152087 hartree
zpe.sumelectthermalfe: -1058.231371 hartree
dipole: -1.2094 -2.2907 0.2697
dipole: 2.6044
quadrupole: -93.3293 -112.1103 -109.3406
quadrupole: -3.8209 -10.8874 -3.8953
quadrupole: 11.5974 -7.1836 -4.4138 -3.8209 -10.8874 -3.8953
hfenergy: -1058.5426591 hartree
pointgroup: C01 [X(C13H26O2S1)]
dipole: -0.4898729 0.8867479 -0.1535617 debye
polarizability: 224.0472882|12.4784805|151.0059127|2.2908103|1.2022519|127.0619007 unknown
InChI: InChI=1S/C13H26O2S/c1-2-16-12-10-8-6-4-3-5-7-9-11-13(14)15/h14H,2-12H2,1H3
charge 0 multiplicity 1
42 atoms
S  -6.156225 -0.645818 0.467294
O  8.22988 0.053793 0.436672
O  7.040691 -1.659329 -0.582032
C  -0.617859 0.307799 -0.327925
C  0.733085 0.889022 0.145964
C  -1.827754 1.192928 0.046529
C  1.945532 0.010625 -0.235672
C  -3.181439 0.598964 -0.401887
C  3.293852 0.587526 0.2507
C  -4.380134 1.504987 -0.038764
C  4.50081 -0.294683 -0.136082
C  -5.748254 0.952866 -0.476766
C  5.834541 0.297245 0.35682
C  7.036899 -0.556003 0.005693
C  -7.928338 -0.894627 -0.160979
C  -8.520741 -2.166002 0.46439
H  -0.591994 0.168648 -1.429032
H  -0.755487 -0.703198 0.109077
H  0.707553 1.019449 1.248276
H  0.866409 1.904291 -0.283608
H  -1.842908 1.345047 1.146197
H  -1.697964 2.199642 -0.40452
H  1.80858 -1.006495 0.186951
H  1.976055 -0.113362 -1.338278
H  -3.168522 0.43365 -1.499598
H  -3.319486 -0.398844 0.060042
H  3.427796 1.606294 -0.170491
H  3.261075 0.708885 1.353999
H  -4.393525 1.686363 1.0547
H  -4.242181 2.49612 -0.519631
H  4.53797 -0.419538 -1.235398
H  4.373361 -1.311596 0.281769
H  -6.552968 1.677096 -0.25466
H  -5.757251 0.72406 -1.558534
H  5.827056 0.430993 1.457051
H  6.002645 1.309035 -0.061801
H  -7.891593 -0.970933 -1.262254
H  -8.516087 -0.001227 0.116536
H  -7.926803 -3.056836 0.193099
H  -8.546318 -2.09272 1.566245
H  -9.555612 -2.322086 0.107234
H  8.998254 -0.532129 0.195474
