program: Gaussian 09
title: 000122074
version: EM64L-G09RevD.01
frameworkgroup: C1[X(C8H8N2)]
method: RPBEPBE
basis: SDD
operation: Freq
keyword: #p
keyword: freq=noraman
keyword: PBEPBE/SDD
title: #p freq=noraman PBEPBE/SDD
converged: YES YES YES YES
title: Mulliken charges:
elementType: N N C C C C C C C C H H H H H H H H
charge: -0.486413 -0.660288 0.235383 0.335409 -0.535684 0.308858 -0.349706 -0.416980 -0.230859 -0.248860 0.294834 0.247012 0.221137 0.230799 0.215650 0.214214 0.324251 0.301243
chargesum: 0.00000
title: Mulliken charges with hydrogens summed into heavy atoms:
elementType: N N C C C C C C C C
charge: -0.191579 -0.034794 0.235383 0.335409 -0.288672 0.308858 -0.128569 -0.186181 -0.015209 -0.034646
polarizability: 1.57882882e+02 1.09997119e-01 1.00083852e+02 3.22144852e-03 7.59005814e-06 4.13368054e+01
1716.lowfreq: -211.5497 -13.6928 -9.0593 -0.0009 -0.0006 0.0002 3.5150 138.4598 236.1100
frequency: -211.5457 138.4589 236.1099 270.7185 281.9321 330.8747 428.4948 432.4622 462.7083 489.7609 575.3130 602.4498 636.1259 664.4359 722.6157 742.6618 764.8258 817.3154 845.4102 878.1287 914.6308 959.2285 980.7335 1011.1641 1015.8885 1107.5351 1162.4103 1168.1341 1224.2841 1240.5230 1310.0820 1340.9587 1410.8292 1435.6952 1473.1568 1483.2605 1580.9796 1603.8112 1633.0584 1648.4008 3118.0873 3125.6666 3141.3597 3159.3562 3215.6959 3587.0587 3607.6936 3726.0763
redmass: 1.1069 4.3955 3.8358 3.3927 1.1326 4.7221 1.3152 2.4848 3.0148 6.3633 3.5426 6.7184 2.9255 5.8505 1.3588 1.8761 2.2276 3.5814 1.4882 5.0165 1.3879 1.2949 3.5946 1.8129 1.6418 1.6583 1.1204 1.4233 2.4805 1.3696 4.2264 1.5048 3.8179 3.4856 3.5854 4.3445 4.6435 3.3729 2.2151 2.6410 1.0847 1.0891 1.0947 1.1000 1.0975 1.0455 1.0801 1.1042
irintensity: 79.5570 14.2850 0.5178 3.7594 222.5164 9.1389 68.3485 48.4964 1.2390 1.5910 0.0212 1.6722 30.1194 11.9295 0.1249 101.7463 80.1746 4.0819 3.5000 0.8087 7.5643 0.1752 7.6530 6.6012 4.6348 4.7506 2.3659 2.5235 5.6686 4.1837 26.9601 3.8741 45.9299 37.7127 34.0847 22.7458 31.6924 139.1621 74.0782 356.0858 2.6694 8.8799 42.5891 31.3852 8.9528 101.1886 34.7572 30.7901
temp: 298.150 k
press: 1.00000 atm
elementType: 7 7 6 6 6 6 6 6 6 6 1 1 1 1 1 1 1 1
symmnumber: 1
zpe: 375068.5 jmol-1
zpe.correction: 0.142856 hartree
zpe.thermalcorrener: 0.150632 hartree
zpe.thermalcorrenthalpy: 0.151576 hartree
zpe.thermalcorrgfe: 0.110845 hartree
zpe.sumelectzpe: -418.459154 hartree
zpe.sumelectthermal: -418.451378 hartree
zpe.sumelectthermalent: -418.450434 hartree
zpe.sumelectthermalfe: -418.491165 hartree
dipole: -4.1971 -1.8150 0.0003
dipole: 4.5727
quadrupole: -41.5712 -48.0417 -65.8685
quadrupole: 2.8295 -0.0007 -0.0001
quadrupole: 10.2559 3.7854 -14.0414 2.8295 -0.0007 -0.0001
hfenergy: -418.6020101 hartree
pointgroup: C01 [X(C8H8N2)]
dipole: 1.6450094 0.7283269 0.0001104 debye
dipolederiv: -0.6950091 0.0583901 0.0000074 -0.0381527 -0.5241775 0.0000028 0.000032 0.0000179 -0.300703 -1.7965766 -0.1367855 0.0000715 -0.2061858 -0.2072774 0.0000426 0.0002186 0.0000619 -0.7582714 0.3507333 0.1260804 -0.0000065 0.6587702 -0.0420976 -0.0000141 -0.0000118 -0.0000085 0.0162824 0.6439888 -0.1043287 -0.0000108 -0.5198887 -0.1230433 0.0000101 -0.0000034 0.0000086 0.0417389 -0.7974778 -0.113463 0.000014 -0.3410637 -0.18132 0.0000105 -0.0000076 -0.0000035 -0.3935359 1.8162619 0.0977841 -0.0000656 0.4254693 0.7247615 -0.0000316 -0.0000998 -0.0000334 0.1446966 0.208687 -0.0546528 -0.0000124 -0.0323407 0.0595786 0.0000022 -0.0000189 0.0000118 -0.2017597 -0.0628286 0.0716889 -0.0000075 -0.0339605 0.1094399 -0.0000004 -0.0000151 -0.0000164 -0.2064439 -0.2063846 0.0013545 -0.0000068 -0.1225266 -0.0135089 0.0000037 0.0000009 -0.0000007 -0.2171167 0.0026431 0.013477 -0.0000107 0.1425612 0.0316422 -0.0000046 -0.0000041 0.0000005 -0.1870085 0.136001 0.0030675 0.0000038 0.0025944 0.154517 0.0000003 0.0000031 -0.0000038 0.3440039 0.0258466 0.058035 0.0000031 0.0932588 -0.0363316 0.0000013 0.000003 0.0000012 0.2305998 0.0799568 -0.0334237 0.0000028 0.0084611 -0.1395241 -0.0000001 0.0000055 -0.0000053 0.1777192 0.0765217 0.0112673 0.0000024 -0.0245955 -0.1312197 0.0000018 0.0000056 0.0000086 0.164174 -0.0974113 0.1035335 0.0000117 0.1058656 0.0193899 -0.0000036 0.0000114 -0.0000036 0.1704523 -0.1216318 -0.1009085 0.0000123 -0.1055234 0.0328779 0.0000036 0.0000121 0.0000036 0.1648634 0.2335925 -0.0105186 -0.0000061 -0.0692797 0.137447 0.0000016 -0.0000468 0.0000109 0.4005565 0.2030872 0.0094025 -0.0000027 0.0565366 0.1288461 -0.0000261 -0.0000848 -0.0000497 0.4097522 unknown
polarizability: 157.8766479|0.6102139|100.0900854|-0.0032213|-0.0000355|41.3368054 unknown
InChI: InChI=1S/C8H8N2/c9-8-5-6-3-1-2-4-7(6)10-8/h1-5,10H,9H2
charge 0 multiplicity 1
18 atoms
N  1.229954 1.10076 -0.000087
N  3.443086 0.099149 -0.000148
C  -0.119259 0.691934 -0.000052
C  -0.12023 -0.749555 -0.000049
C  1.260611 -1.186654 -0.00007
C  2.058133 -0.03482 -0.000093
C  -1.300024 1.456875 -0.000031
C  -1.369784 -1.423733 -0.000026
C  -2.530667 0.758352 0.00003
C  -2.560311 -0.664593 0.000033
H  1.547763 2.067125 -0.000092
H  1.623057 -2.213031 -0.000068
H  -1.276971 2.553049 -0.00003
H  -1.410389 -2.518867 -0.000017
H  -3.471215 1.320449 0.000072
H  -3.528972 -1.1778 0.000077
H  4.021504 -0.733618 -0.000111
H  3.900615 1.004579 -0.000037
